kafka-dev mailing list archives

Site index · List index
Message view « Date » · « Thread »
Top « Date » · « Thread »
From Apache Jenkins Server <jenk...@builds.apache.org>
Subject Build failed in Jenkins: kafka-trunk-jdk8 #869
Date Thu, 08 Sep 2016 18:19:45 GMT
See <https://builds.apache.org/job/kafka-trunk-jdk8/869/changes>

Changes:

[jason] KAFKA-4139; Reset findCoordinatorFuture when brokers are unavailable

------------------------------------------
[...truncated 12315 lines...]
org.apache.kafka.streams.kstream.internals.KTableKTableLeftJoinTest > testNotSendingOldValue
STARTED

org.apache.kafka.streams.kstream.internals.KTableKTableLeftJoinTest > testNotSendingOldValue
PASSED

org.apache.kafka.streams.kstream.internals.KeyValuePrinterProcessorTest > testPrintKeyValueWithProvidedSerde
STARTED

org.apache.kafka.streams.kstream.internals.KeyValuePrinterProcessorTest > testPrintKeyValueWithProvidedSerde
PASSED

org.apache.kafka.streams.kstream.internals.KeyValuePrinterProcessorTest > testPrintKeyValuesWithName
STARTED

org.apache.kafka.streams.kstream.internals.KeyValuePrinterProcessorTest > testPrintKeyValuesWithName
PASSED

org.apache.kafka.streams.kstream.internals.KeyValuePrinterProcessorTest > testPrintKeyValueDefaultSerde
STARTED

org.apache.kafka.streams.kstream.internals.KeyValuePrinterProcessorTest > testPrintKeyValueDefaultSerde
PASSED

org.apache.kafka.streams.kstream.internals.KTableSourceTest > testSendingOldValue STARTED

org.apache.kafka.streams.kstream.internals.KTableSourceTest > testSendingOldValue PASSED

org.apache.kafka.streams.kstream.internals.KTableSourceTest > testNotSendingOldValue STARTED

org.apache.kafka.streams.kstream.internals.KTableSourceTest > testNotSendingOldValue PASSED

org.apache.kafka.streams.kstream.internals.KTableSourceTest > testKTable STARTED

org.apache.kafka.streams.kstream.internals.KTableSourceTest > testKTable PASSED

org.apache.kafka.streams.kstream.internals.KTableSourceTest > testValueGetter STARTED

org.apache.kafka.streams.kstream.internals.KTableSourceTest > testValueGetter PASSED

org.apache.kafka.streams.kstream.internals.KTableMapKeysTest > testMapKeysConvertingToStream
STARTED

org.apache.kafka.streams.kstream.internals.KTableMapKeysTest > testMapKeysConvertingToStream
PASSED

org.apache.kafka.streams.kstream.internals.KStreamForeachTest > testForeach STARTED

org.apache.kafka.streams.kstream.internals.KStreamForeachTest > testForeach PASSED

org.apache.kafka.streams.kstream.internals.KTableKTableOuterJoinTest > testSendingOldValue
STARTED

org.apache.kafka.streams.kstream.internals.KTableKTableOuterJoinTest > testSendingOldValue
PASSED

org.apache.kafka.streams.kstream.internals.KTableKTableOuterJoinTest > testJoin STARTED

org.apache.kafka.streams.kstream.internals.KTableKTableOuterJoinTest > testJoin PASSED

org.apache.kafka.streams.kstream.internals.KTableKTableOuterJoinTest > testNotSendingOldValue
STARTED

org.apache.kafka.streams.kstream.internals.KTableKTableOuterJoinTest > testNotSendingOldValue
PASSED

org.apache.kafka.streams.kstream.internals.KStreamKStreamJoinTest > testOuterJoin STARTED

org.apache.kafka.streams.kstream.internals.KStreamKStreamJoinTest > testOuterJoin PASSED

org.apache.kafka.streams.kstream.internals.KStreamKStreamJoinTest > testJoin STARTED

org.apache.kafka.streams.kstream.internals.KStreamKStreamJoinTest > testJoin PASSED

org.apache.kafka.streams.kstream.internals.KStreamKStreamJoinTest > testWindowing STARTED

org.apache.kafka.streams.kstream.internals.KStreamKStreamJoinTest > testWindowing PASSED

org.apache.kafka.streams.kstream.internals.KStreamFlatMapValuesTest > testFlatMapValues
STARTED

org.apache.kafka.streams.kstream.internals.KStreamFlatMapValuesTest > testFlatMapValues
PASSED

org.apache.kafka.streams.kstream.internals.KTableKTableJoinTest > testJoin STARTED

org.apache.kafka.streams.kstream.internals.KTableKTableJoinTest > testJoin PASSED

org.apache.kafka.streams.kstream.internals.KTableKTableJoinTest > testNotSendingOldValues
STARTED

org.apache.kafka.streams.kstream.internals.KTableKTableJoinTest > testNotSendingOldValues
PASSED

org.apache.kafka.streams.kstream.internals.KTableKTableJoinTest > testSendingOldValues
STARTED

org.apache.kafka.streams.kstream.internals.KTableKTableJoinTest > testSendingOldValues
PASSED

org.apache.kafka.streams.kstream.internals.KTableAggregateTest > testAggBasic STARTED

org.apache.kafka.streams.kstream.internals.KTableAggregateTest > testAggBasic PASSED

org.apache.kafka.streams.kstream.internals.KTableAggregateTest > testCount STARTED

org.apache.kafka.streams.kstream.internals.KTableAggregateTest > testCount PASSED

org.apache.kafka.streams.kstream.internals.KTableAggregateTest > testAggRepartition STARTED

org.apache.kafka.streams.kstream.internals.KTableAggregateTest > testAggRepartition PASSED

org.apache.kafka.streams.kstream.internals.KTableAggregateTest > testRemoveOldBeforeAddNew
STARTED

org.apache.kafka.streams.kstream.internals.KTableAggregateTest > testRemoveOldBeforeAddNew
PASSED

org.apache.kafka.streams.kstream.internals.KStreamFilterTest > testFilterNot STARTED

org.apache.kafka.streams.kstream.internals.KStreamFilterTest > testFilterNot PASSED

org.apache.kafka.streams.kstream.internals.KStreamFilterTest > testFilter STARTED

org.apache.kafka.streams.kstream.internals.KStreamFilterTest > testFilter PASSED

org.apache.kafka.streams.kstream.internals.KStreamFlatMapTest > testFlatMap STARTED

org.apache.kafka.streams.kstream.internals.KStreamFlatMapTest > testFlatMap PASSED

org.apache.kafka.streams.kstream.internals.KStreamWindowAggregateTest > testAggBasic STARTED

org.apache.kafka.streams.kstream.internals.KStreamWindowAggregateTest > testAggBasic PASSED

org.apache.kafka.streams.kstream.internals.KStreamWindowAggregateTest > testJoin STARTED

org.apache.kafka.streams.kstream.internals.KStreamWindowAggregateTest > testJoin PASSED

org.apache.kafka.streams.kstream.internals.KStreamSelectKeyTest > testSelectKey STARTED

org.apache.kafka.streams.kstream.internals.KStreamSelectKeyTest > testSelectKey PASSED

org.apache.kafka.streams.kstream.internals.KStreamMapTest > testMap STARTED

org.apache.kafka.streams.kstream.internals.KStreamMapTest > testMap PASSED

org.apache.kafka.streams.kstream.internals.KStreamTransformValuesTest > testTransform STARTED

org.apache.kafka.streams.kstream.internals.KStreamTransformValuesTest > testTransform PASSED

org.apache.kafka.streams.kstream.internals.KTableFilterTest > testSendingOldValue STARTED

org.apache.kafka.streams.kstream.internals.KTableFilterTest > testSendingOldValue PASSED

org.apache.kafka.streams.kstream.internals.KTableFilterTest > testNotSendingOldValue STARTED

org.apache.kafka.streams.kstream.internals.KTableFilterTest > testNotSendingOldValue PASSED

org.apache.kafka.streams.kstream.internals.KTableFilterTest > testSkipNullOnMaterialization
STARTED

org.apache.kafka.streams.kstream.internals.KTableFilterTest > testSkipNullOnMaterialization
PASSED

org.apache.kafka.streams.kstream.internals.KTableFilterTest > testKTable STARTED

org.apache.kafka.streams.kstream.internals.KTableFilterTest > testKTable PASSED

org.apache.kafka.streams.kstream.internals.KTableFilterTest > testValueGetter STARTED

org.apache.kafka.streams.kstream.internals.KTableFilterTest > testValueGetter PASSED

org.apache.kafka.streams.kstream.internals.KStreamTransformTest > testTransform STARTED

org.apache.kafka.streams.kstream.internals.KStreamTransformTest > testTransform PASSED

org.apache.kafka.streams.kstream.internals.KGroupedStreamImplTest > shouldNotHaveNullReducerOnReduce
STARTED

org.apache.kafka.streams.kstream.internals.KGroupedStreamImplTest > shouldNotHaveNullReducerOnReduce
PASSED

org.apache.kafka.streams.kstream.internals.KGroupedStreamImplTest > shouldNotHaveNullStoreNameOnReduce
STARTED

org.apache.kafka.streams.kstream.internals.KGroupedStreamImplTest > shouldNotHaveNullStoreNameOnReduce
PASSED

org.apache.kafka.streams.kstream.internals.KGroupedStreamImplTest > shouldNotHaveNullAdderOnWindowedAggregate
STARTED

org.apache.kafka.streams.kstream.internals.KGroupedStreamImplTest > shouldNotHaveNullAdderOnWindowedAggregate
PASSED

org.apache.kafka.streams.kstream.internals.KGroupedStreamImplTest > shouldNotHaveNullInitializerOnWindowedAggregate
STARTED

org.apache.kafka.streams.kstream.internals.KGroupedStreamImplTest > shouldNotHaveNullInitializerOnWindowedAggregate
PASSED

org.apache.kafka.streams.kstream.internals.KGroupedStreamImplTest > shouldNotHaveNullReducerWithWindowedReduce
STARTED

org.apache.kafka.streams.kstream.internals.KGroupedStreamImplTest > shouldNotHaveNullReducerWithWindowedReduce
PASSED

org.apache.kafka.streams.kstream.internals.KGroupedStreamImplTest > shouldNotHaveNullStoreNameOnAggregate
STARTED

org.apache.kafka.streams.kstream.internals.KGroupedStreamImplTest > shouldNotHaveNullStoreNameOnAggregate
PASSED

org.apache.kafka.streams.kstream.internals.KGroupedStreamImplTest > shouldNotHaveNullAdderOnAggregate
STARTED

org.apache.kafka.streams.kstream.internals.KGroupedStreamImplTest > shouldNotHaveNullAdderOnAggregate
PASSED

org.apache.kafka.streams.kstream.internals.KGroupedStreamImplTest > shouldNotHaveNullWindowsWithWindowedReduce
STARTED

org.apache.kafka.streams.kstream.internals.KGroupedStreamImplTest > shouldNotHaveNullWindowsWithWindowedReduce
PASSED

org.apache.kafka.streams.kstream.internals.KGroupedStreamImplTest > shouldNotHaveNullWindowsOnWindowedAggregate
STARTED

org.apache.kafka.streams.kstream.internals.KGroupedStreamImplTest > shouldNotHaveNullWindowsOnWindowedAggregate
PASSED

org.apache.kafka.streams.kstream.internals.KGroupedStreamImplTest > shouldNotHaveNullStoreNameOnWindowedAggregate
STARTED

org.apache.kafka.streams.kstream.internals.KGroupedStreamImplTest > shouldNotHaveNullStoreNameOnWindowedAggregate
PASSED

org.apache.kafka.streams.kstream.internals.KGroupedStreamImplTest > shouldNotHaveNullStoreNameWithWindowedReduce
STARTED

org.apache.kafka.streams.kstream.internals.KGroupedStreamImplTest > shouldNotHaveNullStoreNameWithWindowedReduce
PASSED

org.apache.kafka.streams.kstream.internals.KGroupedStreamImplTest > shouldNotHaveNullInitializerOnAggregate
STARTED

org.apache.kafka.streams.kstream.internals.KGroupedStreamImplTest > shouldNotHaveNullInitializerOnAggregate
PASSED

org.apache.kafka.streams.kstream.KStreamBuilderTest > shouldHaveCorrectSourceTopicsForTableFromMergedStream
STARTED

org.apache.kafka.streams.kstream.KStreamBuilderTest > shouldHaveCorrectSourceTopicsForTableFromMergedStream
PASSED

org.apache.kafka.streams.kstream.KStreamBuilderTest > shouldHaveCorrectSourceTopicsForTableFromMergedStreamWithProcessors
STARTED

org.apache.kafka.streams.kstream.KStreamBuilderTest > shouldHaveCorrectSourceTopicsForTableFromMergedStreamWithProcessors
PASSED

org.apache.kafka.streams.kstream.KStreamBuilderTest > testMerge STARTED

org.apache.kafka.streams.kstream.KStreamBuilderTest > testMerge PASSED

org.apache.kafka.streams.kstream.KStreamBuilderTest > testFrom STARTED

org.apache.kafka.streams.kstream.KStreamBuilderTest > testFrom PASSED

org.apache.kafka.streams.kstream.KStreamBuilderTest > shouldThrowExceptionWhenTopicNamesAreNull
STARTED

org.apache.kafka.streams.kstream.KStreamBuilderTest > shouldThrowExceptionWhenTopicNamesAreNull
PASSED

org.apache.kafka.streams.kstream.KStreamBuilderTest > shouldThrowExceptionWhenNoTopicPresent
STARTED

org.apache.kafka.streams.kstream.KStreamBuilderTest > shouldThrowExceptionWhenNoTopicPresent
PASSED

org.apache.kafka.streams.kstream.KStreamBuilderTest > testNewName STARTED

org.apache.kafka.streams.kstream.KStreamBuilderTest > testNewName PASSED
pure virtual method called
terminate called without an active exception

355 tests completed, 9 failed
:streams:test FAILED

FAILURE: Build failed with an exception.

* What went wrong:
Execution failed for task ':streams:test'.
> Process 'Gradle Test Executor 4' finished with non-zero exit value 134

* Try:
Run with --stacktrace option to get the stack trace. Run with --info or --debug option to
get more log output.

BUILD FAILED

Total time: 1 hrs 6 mins 49.384 secs
Build step 'Execute shell' marked build as failure
Recording test results
Setting GRADLE_2_4_RC_2_HOME=/home/jenkins/jenkins-slave/tools/hudson.plugins.gradle.GradleInstallation/Gradle_2.4-rc-2
Setting GRADLE_2_4_RC_2_HOME=/home/jenkins/jenkins-slave/tools/hudson.plugins.gradle.GradleInstallation/Gradle_2.4-rc-2

Mime
View raw message