kafka-dev mailing list archives

Site index · List index
Message view « Date » · « Thread »
Top « Date » · « Thread »
From Apache Jenkins Server <jenk...@builds.apache.org>
Subject Build failed in Jenkins: kafka-trunk-jdk7 #1518
Date Wed, 07 Sep 2016 00:11:44 GMT
See <https://builds.apache.org/job/kafka-trunk-jdk7/1518/changes>

Changes:

[wangguoz] MINOR: changes embedded broker time to MockTime

------------------------------------------
[...truncated 1484 lines...]
kafka.api.SslEndToEndAuthorizationTest > testNoProduceAcl STARTED

kafka.api.SslEndToEndAuthorizationTest > testNoProduceAcl PASSED

kafka.api.SslEndToEndAuthorizationTest > testNoGroupAcl STARTED

kafka.api.SslEndToEndAuthorizationTest > testNoGroupAcl PASSED

kafka.api.SslEndToEndAuthorizationTest > testProduceConsumeViaSubscribe STARTED

kafka.api.SslEndToEndAuthorizationTest > testProduceConsumeViaSubscribe PASSED

kafka.api.SaslSslConsumerTest > testCoordinatorFailover STARTED

kafka.api.SaslSslConsumerTest > testCoordinatorFailover PASSED

kafka.api.SaslSslConsumerTest > testSimpleConsumption STARTED

kafka.api.SaslSslConsumerTest > testSimpleConsumption PASSED

kafka.api.test.ProducerCompressionTest > testCompression[0] STARTED

kafka.api.test.ProducerCompressionTest > testCompression[0] PASSED

kafka.api.test.ProducerCompressionTest > testCompression[1] STARTED

kafka.api.test.ProducerCompressionTest > testCompression[1] PASSED

kafka.api.test.ProducerCompressionTest > testCompression[2] STARTED

kafka.api.test.ProducerCompressionTest > testCompression[2] PASSED

kafka.api.test.ProducerCompressionTest > testCompression[3] STARTED

kafka.api.test.ProducerCompressionTest > testCompression[3] PASSED

kafka.api.SaslPlainSslEndToEndAuthorizationTest > testNoConsumeAcl STARTED

kafka.api.SaslPlainSslEndToEndAuthorizationTest > testNoConsumeAcl PASSED

kafka.api.SaslPlainSslEndToEndAuthorizationTest > testProduceConsumeViaAssign STARTED

kafka.api.SaslPlainSslEndToEndAuthorizationTest > testProduceConsumeViaAssign PASSED

kafka.api.SaslPlainSslEndToEndAuthorizationTest > testNoProduceAcl STARTED

kafka.api.SaslPlainSslEndToEndAuthorizationTest > testNoProduceAcl PASSED

kafka.api.SaslPlainSslEndToEndAuthorizationTest > testNoGroupAcl STARTED

kafka.api.SaslPlainSslEndToEndAuthorizationTest > testNoGroupAcl PASSED

kafka.api.SaslPlainSslEndToEndAuthorizationTest > testProduceConsumeViaSubscribe STARTED

kafka.api.SaslPlainSslEndToEndAuthorizationTest > testProduceConsumeViaSubscribe PASSED

kafka.api.SslConsumerTest > testCoordinatorFailover STARTED

kafka.api.SslConsumerTest > testCoordinatorFailover PASSED

kafka.api.SslConsumerTest > testSimpleConsumption STARTED

kafka.api.SslConsumerTest > testSimpleConsumption PASSED

kafka.api.ProducerFailureHandlingTest > testCannotSendToInternalTopic STARTED

kafka.api.ProducerFailureHandlingTest > testCannotSendToInternalTopic PASSED

kafka.api.ProducerFailureHandlingTest > testTooLargeRecordWithAckOne STARTED

kafka.api.ProducerFailureHandlingTest > testTooLargeRecordWithAckOne PASSED

kafka.api.ProducerFailureHandlingTest > testWrongBrokerList STARTED

kafka.api.ProducerFailureHandlingTest > testWrongBrokerList PASSED

kafka.api.ProducerFailureHandlingTest > testNotEnoughReplicas STARTED

kafka.api.ProducerFailureHandlingTest > testNotEnoughReplicas PASSED

kafka.api.ProducerFailureHandlingTest > testNonExistentTopic STARTED

kafka.api.ProducerFailureHandlingTest > testNonExistentTopic PASSED

kafka.api.ProducerFailureHandlingTest > testInvalidPartition STARTED

kafka.api.ProducerFailureHandlingTest > testInvalidPartition PASSED

kafka.api.ProducerFailureHandlingTest > testSendAfterClosed STARTED

kafka.api.ProducerFailureHandlingTest > testSendAfterClosed PASSED

kafka.api.ProducerFailureHandlingTest > testTooLargeRecordWithAckZero STARTED

kafka.api.ProducerFailureHandlingTest > testTooLargeRecordWithAckZero PASSED

kafka.api.ProducerFailureHandlingTest > testNotEnoughReplicasAfterBrokerShutdown STARTED

kafka.api.ProducerFailureHandlingTest > testNotEnoughReplicasAfterBrokerShutdown PASSED

kafka.api.ProducerBounceTest > testBrokerFailure STARTED

kafka.api.ProducerBounceTest > testBrokerFailure PASSED

kafka.api.SaslPlaintextConsumerTest > testCoordinatorFailover STARTED

kafka.api.SaslPlaintextConsumerTest > testCoordinatorFailover PASSED

kafka.api.SaslPlaintextConsumerTest > testSimpleConsumption STARTED

kafka.api.SaslPlaintextConsumerTest > testSimpleConsumption PASSED

kafka.api.SslProducerSendTest > testSendNonCompressedMessageWithCreateTime STARTED

kafka.api.SslProducerSendTest > testSendNonCompressedMessageWithCreateTime PASSED

kafka.api.SslProducerSendTest > testSendCompressedMessageWithLogAppendTime STARTED

kafka.api.SslProducerSendTest > testSendCompressedMessageWithLogAppendTime PASSED

kafka.api.SslProducerSendTest > testClose STARTED

kafka.api.SslProducerSendTest > testClose PASSED

kafka.api.SslProducerSendTest > testFlush STARTED

kafka.api.SslProducerSendTest > testFlush PASSED

kafka.api.SslProducerSendTest > testSendToPartition STARTED

kafka.api.SslProducerSendTest > testSendToPartition PASSED

kafka.api.SslProducerSendTest > testSendOffset STARTED

kafka.api.SslProducerSendTest > testSendOffset PASSED

kafka.api.SslProducerSendTest > testAutoCreateTopic STARTED

kafka.api.SslProducerSendTest > testAutoCreateTopic PASSED

kafka.api.SslProducerSendTest > testSendWithInvalidCreateTime STARTED

kafka.api.SslProducerSendTest > testSendWithInvalidCreateTime PASSED

kafka.api.SslProducerSendTest > testSendCompressedMessageWithCreateTime STARTED

kafka.api.SslProducerSendTest > testSendCompressedMessageWithCreateTime PASSED

kafka.api.SslProducerSendTest > testCloseWithZeroTimeoutFromCallerThread STARTED

kafka.api.SslProducerSendTest > testCloseWithZeroTimeoutFromCallerThread PASSED

kafka.api.SslProducerSendTest > testCloseWithZeroTimeoutFromSenderThread STARTED

kafka.api.SslProducerSendTest > testCloseWithZeroTimeoutFromSenderThread PASSED

kafka.api.SslProducerSendTest > testSendNonCompressedMessageWithLogApendTime STARTED

kafka.api.SslProducerSendTest > testSendNonCompressedMessageWithLogApendTime PASSED

kafka.api.SaslPlainPlaintextConsumerTest > testCoordinatorFailover STARTED

kafka.api.SaslPlainPlaintextConsumerTest > testCoordinatorFailover PASSED

kafka.api.SaslPlainPlaintextConsumerTest > testSimpleConsumption STARTED

kafka.api.SaslPlainPlaintextConsumerTest > testSimpleConsumption PASSED

kafka.api.AuthorizerIntegrationTest > testCommitWithTopicWrite STARTED

kafka.api.AuthorizerIntegrationTest > testCommitWithTopicWrite PASSED

kafka.api.AuthorizerIntegrationTest > testConsumeWithNoTopicAccess STARTED

kafka.api.AuthorizerIntegrationTest > testConsumeWithNoTopicAccess PASSED

kafka.api.AuthorizerIntegrationTest > testCreatePermissionNeededToReadFromNonExistentTopic
STARTED

kafka.api.AuthorizerIntegrationTest > testCreatePermissionNeededToReadFromNonExistentTopic
PASSED

kafka.api.AuthorizerIntegrationTest > testDeleteWithWildCardAuth STARTED

kafka.api.AuthorizerIntegrationTest > testDeleteWithWildCardAuth PASSED

kafka.api.AuthorizerIntegrationTest > testOffsetFetchWithNoAccess STARTED

kafka.api.AuthorizerIntegrationTest > testOffsetFetchWithNoAccess PASSED

kafka.api.AuthorizerIntegrationTest > testListOfsetsWithTopicDescribe STARTED

kafka.api.AuthorizerIntegrationTest > testListOfsetsWithTopicDescribe PASSED

kafka.api.AuthorizerIntegrationTest > testProduceWithTopicRead STARTED

kafka.api.AuthorizerIntegrationTest > testProduceWithTopicRead PASSED

kafka.api.AuthorizerIntegrationTest > testListOffsetsWithNoTopicAccess STARTED

kafka.api.AuthorizerIntegrationTest > testListOffsetsWithNoTopicAccess PASSED

kafka.api.AuthorizerIntegrationTest > testCreatePermissionNeededForWritingToNonExistentTopic
STARTED

kafka.api.AuthorizerIntegrationTest > testCreatePermissionNeededForWritingToNonExistentTopic
PASSED

kafka.api.AuthorizerIntegrationTest > testSimpleConsumeWithOffsetLookupAndNoGroupAccess
STARTED

kafka.api.AuthorizerIntegrationTest > testSimpleConsumeWithOffsetLookupAndNoGroupAccess
PASSED

kafka.api.AuthorizerIntegrationTest > testConsumeWithTopicDescribe STARTED

kafka.api.AuthorizerIntegrationTest > testConsumeWithTopicDescribe PASSED

kafka.api.AuthorizerIntegrationTest > testOffsetFetchWithNoTopicAccess STARTED

kafka.api.AuthorizerIntegrationTest > testOffsetFetchWithNoTopicAccess PASSED

kafka.api.AuthorizerIntegrationTest > testCommitWithNoTopicAccess STARTED

kafka.api.AuthorizerIntegrationTest > testCommitWithNoTopicAccess PASSED

kafka.api.AuthorizerIntegrationTest > testProduceWithNoTopicAccess STARTED

kafka.api.AuthorizerIntegrationTest > testProduceWithNoTopicAccess PASSED

kafka.api.AuthorizerIntegrationTest > testProduceWithTopicWrite STARTED

kafka.api.AuthorizerIntegrationTest > testProduceWithTopicWrite PASSED

kafka.api.AuthorizerIntegrationTest > testAuthorization STARTED
:kafka-trunk-jdk7:core:test FAILED
:test_core_2_10 FAILED

FAILURE: Build failed with an exception.

* What went wrong:
Execution failed for task ':core:test'.
> Process 'Gradle Test Executor 1' finished with non-zero exit value 1

* Try:
Run with --stacktrace option to get the stack trace. Run with --info or --debug option to
get more log output.

BUILD FAILED

Total time: 32 mins 59.969 secs
Build step 'Execute shell' marked build as failure
Recording test results
Setting GRADLE_2_4_RC_2_HOME=/home/jenkins/jenkins-slave/tools/hudson.plugins.gradle.GradleInstallation/Gradle_2.4-rc-2
ERROR: Step ?Publish JUnit test result report? failed: No test report files were found. Configuration
error?
Setting GRADLE_2_4_RC_2_HOME=/home/jenkins/jenkins-slave/tools/hudson.plugins.gradle.GradleInstallation/Gradle_2.4-rc-2

Mime
View raw message