kafka-dev mailing list archives

Site index · List index
Message view « Date » · « Thread »
Top « Date » · « Thread »
From Apache Jenkins Server <jenk...@builds.apache.org>
Subject Build failed in Jenkins: kafka-trunk-jdk8 #827
Date Sat, 20 Aug 2016 01:14:15 GMT
See <https://builds.apache.org/job/kafka-trunk-jdk8/827/changes>

Changes:

[wangguoz] KAFKA-4016: Added join benchmarks

------------------------------------------
[...truncated 12090 lines...]
org.apache.kafka.streams.processor.internals.assignment.AssignmentInfoTest > shouldDecodePreviousVersion
PASSED

org.apache.kafka.streams.processor.internals.assignment.SubscriptionInfoTest > testEncodeDecode
STARTED

org.apache.kafka.streams.processor.internals.assignment.SubscriptionInfoTest > testEncodeDecode
PASSED

org.apache.kafka.streams.processor.internals.assignment.SubscriptionInfoTest > shouldEncodeDecodeWithUserEndPoint
STARTED

org.apache.kafka.streams.processor.internals.assignment.SubscriptionInfoTest > shouldEncodeDecodeWithUserEndPoint
PASSED

org.apache.kafka.streams.processor.internals.assignment.SubscriptionInfoTest > shouldBeBackwardCompatible
STARTED

org.apache.kafka.streams.processor.internals.assignment.SubscriptionInfoTest > shouldBeBackwardCompatible
PASSED

org.apache.kafka.streams.processor.internals.StreamThreadTest > testInjectClients STARTED

org.apache.kafka.streams.processor.internals.StreamThreadTest > testInjectClients PASSED

org.apache.kafka.streams.processor.internals.StreamThreadTest > testMaybeCommit STARTED

org.apache.kafka.streams.processor.internals.StreamThreadTest > testMaybeCommit PASSED

org.apache.kafka.streams.processor.internals.StreamThreadTest > testPartitionAssignmentChange
STARTED

org.apache.kafka.streams.processor.internals.StreamThreadTest > testPartitionAssignmentChange
PASSED

org.apache.kafka.streams.processor.internals.StreamThreadTest > testMaybeClean STARTED

org.apache.kafka.streams.processor.internals.StreamThreadTest > testMaybeClean PASSED

org.apache.kafka.streams.processor.internals.PunctuationQueueTest > testPunctuationInterval
STARTED

org.apache.kafka.streams.processor.internals.PunctuationQueueTest > testPunctuationInterval
PASSED

org.apache.kafka.streams.processor.internals.RecordQueueTest > testTimeTracking STARTED

org.apache.kafka.streams.processor.internals.RecordQueueTest > testTimeTracking PASSED

org.apache.kafka.streams.processor.internals.ProcessorStateManagerTest > testRegisterNonPersistentStore
STARTED

org.apache.kafka.streams.processor.internals.ProcessorStateManagerTest > testRegisterNonPersistentStore
PASSED

org.apache.kafka.streams.processor.internals.ProcessorStateManagerTest > testGetStore STARTED

org.apache.kafka.streams.processor.internals.ProcessorStateManagerTest > testGetStore PASSED

org.apache.kafka.streams.processor.internals.ProcessorStateManagerTest > testClose STARTED

org.apache.kafka.streams.processor.internals.ProcessorStateManagerTest > testClose PASSED

org.apache.kafka.streams.processor.internals.ProcessorStateManagerTest > testChangeLogOffsets
STARTED

org.apache.kafka.streams.processor.internals.ProcessorStateManagerTest > testChangeLogOffsets
PASSED

org.apache.kafka.streams.processor.internals.ProcessorStateManagerTest > testRegisterPersistentStore
STARTED

org.apache.kafka.streams.processor.internals.ProcessorStateManagerTest > testRegisterPersistentStore
PASSED

org.apache.kafka.streams.processor.internals.ProcessorStateManagerTest > testNoTopic STARTED

org.apache.kafka.streams.processor.internals.ProcessorStateManagerTest > testNoTopic PASSED

org.apache.kafka.streams.processor.internals.StreamTaskTest > testProcessOrder STARTED

org.apache.kafka.streams.processor.internals.StreamTaskTest > testProcessOrder PASSED

org.apache.kafka.streams.processor.internals.StreamTaskTest > testPauseResume STARTED

org.apache.kafka.streams.processor.internals.StreamTaskTest > testPauseResume PASSED

org.apache.kafka.streams.processor.internals.StreamTaskTest > testMaybePunctuate STARTED

org.apache.kafka.streams.processor.internals.StreamTaskTest > testMaybePunctuate PASSED

org.apache.kafka.streams.processor.internals.QuickUnionTest > testUnite STARTED

org.apache.kafka.streams.processor.internals.QuickUnionTest > testUnite PASSED

org.apache.kafka.streams.processor.internals.QuickUnionTest > testUniteMany STARTED

org.apache.kafka.streams.processor.internals.QuickUnionTest > testUniteMany PASSED

org.apache.kafka.streams.processor.TopologyBuilderTest > shouldNotAllowNullProcessorSupplier
STARTED

org.apache.kafka.streams.processor.TopologyBuilderTest > shouldNotAllowNullProcessorSupplier
PASSED

org.apache.kafka.streams.processor.TopologyBuilderTest > shouldNotSetApplicationIdToNull
STARTED

org.apache.kafka.streams.processor.TopologyBuilderTest > shouldNotSetApplicationIdToNull
PASSED

org.apache.kafka.streams.processor.TopologyBuilderTest > shouldNotAllowNullApplicationIdOnBuild
STARTED

org.apache.kafka.streams.processor.TopologyBuilderTest > shouldNotAllowNullApplicationIdOnBuild
PASSED

org.apache.kafka.streams.processor.TopologyBuilderTest > testSourceTopics STARTED

org.apache.kafka.streams.processor.TopologyBuilderTest > testSourceTopics PASSED

org.apache.kafka.streams.processor.TopologyBuilderTest > shouldNotAllowNullNameWhenAddingSink
STARTED

org.apache.kafka.streams.processor.TopologyBuilderTest > shouldNotAllowNullNameWhenAddingSink
PASSED

org.apache.kafka.streams.processor.TopologyBuilderTest > testNamedTopicMatchesAlreadyProvidedPattern
STARTED

org.apache.kafka.streams.processor.TopologyBuilderTest > testNamedTopicMatchesAlreadyProvidedPattern
PASSED

org.apache.kafka.streams.processor.TopologyBuilderTest > testAddSinkWithSameName STARTED

org.apache.kafka.streams.processor.TopologyBuilderTest > testAddSinkWithSameName PASSED

org.apache.kafka.streams.processor.TopologyBuilderTest > testAddSinkWithSelfParent STARTED

org.apache.kafka.streams.processor.TopologyBuilderTest > testAddSinkWithSelfParent PASSED

org.apache.kafka.streams.processor.TopologyBuilderTest > testAddProcessorWithSelfParent
STARTED

org.apache.kafka.streams.processor.TopologyBuilderTest > testAddProcessorWithSelfParent
PASSED

org.apache.kafka.streams.processor.TopologyBuilderTest > shouldAssociateStateStoreNameWhenStateStoreSupplierIsInternal
STARTED

org.apache.kafka.streams.processor.TopologyBuilderTest > shouldAssociateStateStoreNameWhenStateStoreSupplierIsInternal
PASSED

org.apache.kafka.streams.processor.TopologyBuilderTest > testAddStateStoreWithSink STARTED

org.apache.kafka.streams.processor.TopologyBuilderTest > testAddStateStoreWithSink PASSED

org.apache.kafka.streams.processor.TopologyBuilderTest > testTopicGroups STARTED

org.apache.kafka.streams.processor.TopologyBuilderTest > testTopicGroups PASSED

org.apache.kafka.streams.processor.TopologyBuilderTest > testBuild STARTED

org.apache.kafka.streams.processor.TopologyBuilderTest > testBuild PASSED

org.apache.kafka.streams.processor.TopologyBuilderTest > shouldNotAddNullStateStoreSupplier
STARTED

org.apache.kafka.streams.processor.TopologyBuilderTest > shouldNotAddNullStateStoreSupplier
PASSED

org.apache.kafka.streams.processor.TopologyBuilderTest > shouldNotAllowNullNameWhenAddingSource
STARTED

org.apache.kafka.streams.processor.TopologyBuilderTest > shouldNotAllowNullNameWhenAddingSource
PASSED

org.apache.kafka.streams.processor.TopologyBuilderTest > shouldNotAllowNullTopicWhenAddingSink
STARTED

org.apache.kafka.streams.processor.TopologyBuilderTest > shouldNotAllowNullTopicWhenAddingSink
PASSED

org.apache.kafka.streams.processor.TopologyBuilderTest > testAddStateStoreWithSource STARTED

org.apache.kafka.streams.processor.TopologyBuilderTest > testAddStateStoreWithSource PASSED

org.apache.kafka.streams.processor.TopologyBuilderTest > shouldNotAllowNullProcessorNameWhenConnectingProcessorAndStateStores
STARTED

org.apache.kafka.streams.processor.TopologyBuilderTest > shouldNotAllowNullProcessorNameWhenConnectingProcessorAndStateStores
PASSED

org.apache.kafka.streams.processor.TopologyBuilderTest > testAddSourceWithSameName STARTED

org.apache.kafka.streams.processor.TopologyBuilderTest > testAddSourceWithSameName PASSED

org.apache.kafka.streams.processor.TopologyBuilderTest > testAddMoreThanOnePatternSourceNode
STARTED

org.apache.kafka.streams.processor.TopologyBuilderTest > testAddMoreThanOnePatternSourceNode
PASSED

org.apache.kafka.streams.processor.TopologyBuilderTest > testAddProcessorWithSameName STARTED

org.apache.kafka.streams.processor.TopologyBuilderTest > testAddProcessorWithSameName PASSED

org.apache.kafka.streams.processor.TopologyBuilderTest > testAddSourceWithSameTopic STARTED

org.apache.kafka.streams.processor.TopologyBuilderTest > testAddSourceWithSameTopic PASSED

org.apache.kafka.streams.processor.TopologyBuilderTest > testTopicGroupsByStateStore STARTED

org.apache.kafka.streams.processor.TopologyBuilderTest > testTopicGroupsByStateStore PASSED

org.apache.kafka.streams.processor.TopologyBuilderTest > testAddStateStoreWithDuplicates
STARTED

org.apache.kafka.streams.processor.TopologyBuilderTest > testAddStateStoreWithDuplicates
PASSED

org.apache.kafka.streams.processor.TopologyBuilderTest > testPatternSourceTopic STARTED

org.apache.kafka.streams.processor.TopologyBuilderTest > testPatternSourceTopic PASSED

org.apache.kafka.streams.processor.TopologyBuilderTest > shouldAssociateStateStoreNameWhenStateStoreSupplierIsExternal
STARTED

org.apache.kafka.streams.processor.TopologyBuilderTest > shouldAssociateStateStoreNameWhenStateStoreSupplierIsExternal
PASSED

org.apache.kafka.streams.processor.TopologyBuilderTest > testAddSinkWithWrongParent STARTED

org.apache.kafka.streams.processor.TopologyBuilderTest > testAddSinkWithWrongParent PASSED

org.apache.kafka.streams.processor.TopologyBuilderTest > testPatternMatchesAlreadyProvidedTopicSource
STARTED

org.apache.kafka.streams.processor.TopologyBuilderTest > testPatternMatchesAlreadyProvidedTopicSource
PASSED

org.apache.kafka.streams.processor.TopologyBuilderTest > testAddSinkConnectedWithMultipleParent
STARTED

org.apache.kafka.streams.processor.TopologyBuilderTest > testAddSinkConnectedWithMultipleParent
PASSED

org.apache.kafka.streams.processor.TopologyBuilderTest > testSubscribeTopicNameAndPattern
STARTED

org.apache.kafka.streams.processor.TopologyBuilderTest > testSubscribeTopicNameAndPattern
PASSED

org.apache.kafka.streams.processor.TopologyBuilderTest > shouldNotAddNullInternalTopic
STARTED

org.apache.kafka.streams.processor.TopologyBuilderTest > shouldNotAddNullInternalTopic
PASSED

org.apache.kafka.streams.processor.TopologyBuilderTest > testAddProcessorWithWrongParent
STARTED

org.apache.kafka.streams.processor.TopologyBuilderTest > testAddProcessorWithWrongParent
PASSED

org.apache.kafka.streams.processor.TopologyBuilderTest > shouldNotAllowNullNameWhenAddingProcessor
STARTED

org.apache.kafka.streams.processor.TopologyBuilderTest > shouldNotAllowNullNameWhenAddingProcessor
PASSED

org.apache.kafka.streams.processor.TopologyBuilderTest > testAddStateStore STARTED

org.apache.kafka.streams.processor.TopologyBuilderTest > testAddStateStore PASSED

org.apache.kafka.streams.processor.TopologyBuilderTest > testAddSinkConnectedWithParent
STARTED

org.apache.kafka.streams.processor.TopologyBuilderTest > testAddSinkConnectedWithParent
PASSED

org.apache.kafka.streams.processor.TopologyBuilderTest > testAddStateStoreWithNonExistingProcessor
STARTED

org.apache.kafka.streams.processor.TopologyBuilderTest > testAddStateStoreWithNonExistingProcessor
PASSED

org.apache.kafka.streams.processor.TopologyBuilderTest > shouldCorrectlyMapStateStoreToInternalTopics
STARTED

org.apache.kafka.streams.processor.TopologyBuilderTest > shouldCorrectlyMapStateStoreToInternalTopics
PASSED

354 tests completed, 1 failed
:streams:test FAILED

FAILURE: Build failed with an exception.

* What went wrong:
Execution failed for task ':streams:test'.
> There were failing tests. See the report at: file://<https://builds.apache.org/job/kafka-trunk-jdk8/ws/streams/build/reports/tests/index.html>

* Try:
Run with --stacktrace option to get the stack trace. Run with --info or --debug option to
get more log output.

BUILD FAILED

Total time: 2 hrs 1 mins 21.184 secs
Build step 'Execute shell' marked build as failure
Recording test results
Setting GRADLE_2_4_RC_2_HOME=/home/jenkins/jenkins-slave/tools/hudson.plugins.gradle.GradleInstallation/Gradle_2.4-rc-2
Setting GRADLE_2_4_RC_2_HOME=/home/jenkins/jenkins-slave/tools/hudson.plugins.gradle.GradleInstallation/Gradle_2.4-rc-2

Mime
View raw message