kafka-dev mailing list archives

Site index · List index
Message view « Date » · « Thread »
Top « Date » · « Thread »
From Apache Jenkins Server <jenk...@builds.apache.org>
Subject Build failed in Jenkins: kafka-trunk-jdk8 #828
Date Sat, 20 Aug 2016 06:56:56 GMT
See <https://builds.apache.org/job/kafka-trunk-jdk8/828/changes>

Changes:

[wangguoz] KAFKA-3949: Fix race condition when metadata update arrives during

------------------------------------------
[...truncated 12070 lines...]
org.apache.kafka.streams.kstream.internals.KStreamImplTest > shouldCantHaveNullPredicate
PASSED

org.apache.kafka.streams.kstream.internals.KStreamImplTest > shouldNotAllowNullActionOnForEach
STARTED

org.apache.kafka.streams.kstream.internals.KStreamImplTest > shouldNotAllowNullActionOnForEach
PASSED

org.apache.kafka.streams.kstream.internals.KStreamImplTest > shouldNotAllowNullValueMapperOnTableJoin
STARTED

org.apache.kafka.streams.kstream.internals.KStreamImplTest > shouldNotAllowNullValueMapperOnTableJoin
PASSED

org.apache.kafka.streams.kstream.internals.KStreamImplTest > shouldNotAllowNullPredicateOnFilterNot
STARTED

org.apache.kafka.streams.kstream.internals.KStreamImplTest > shouldNotAllowNullPredicateOnFilterNot
PASSED

org.apache.kafka.streams.kstream.internals.KStreamImplTest > shouldHaveAtLeastOnPredicateWhenBranching
STARTED

org.apache.kafka.streams.kstream.internals.KStreamImplTest > shouldHaveAtLeastOnPredicateWhenBranching
PASSED

org.apache.kafka.streams.kstream.internals.KStreamImplTest > shouldNotAllowNullFilePathOnWriteAsText
STARTED

org.apache.kafka.streams.kstream.internals.KStreamImplTest > shouldNotAllowNullFilePathOnWriteAsText
PASSED

org.apache.kafka.streams.kstream.internals.KeyValuePrinterProcessorTest > testPrintKeyValueWithProvidedSerde
STARTED

org.apache.kafka.streams.kstream.internals.KeyValuePrinterProcessorTest > testPrintKeyValueWithProvidedSerde
PASSED

org.apache.kafka.streams.kstream.internals.KeyValuePrinterProcessorTest > testPrintKeyValuesWithName
STARTED

org.apache.kafka.streams.kstream.internals.KeyValuePrinterProcessorTest > testPrintKeyValuesWithName
PASSED

org.apache.kafka.streams.kstream.internals.KeyValuePrinterProcessorTest > testPrintKeyValueDefaultSerde
STARTED

org.apache.kafka.streams.kstream.internals.KeyValuePrinterProcessorTest > testPrintKeyValueDefaultSerde
PASSED

org.apache.kafka.streams.kstream.internals.KStreamKTableLeftJoinTest > testJoin STARTED

org.apache.kafka.streams.kstream.internals.KStreamKTableLeftJoinTest > testJoin PASSED

org.apache.kafka.streams.kstream.internals.KTableKTableJoinTest > testJoin STARTED

org.apache.kafka.streams.kstream.internals.KTableKTableJoinTest > testJoin PASSED

org.apache.kafka.streams.kstream.internals.KTableKTableJoinTest > testNotSendingOldValues
STARTED

org.apache.kafka.streams.kstream.internals.KTableKTableJoinTest > testNotSendingOldValues
PASSED

org.apache.kafka.streams.kstream.internals.KTableKTableJoinTest > testSendingOldValues
STARTED

org.apache.kafka.streams.kstream.internals.KTableKTableJoinTest > testSendingOldValues
PASSED

org.apache.kafka.streams.kstream.internals.KTableFilterTest > testSendingOldValue STARTED

org.apache.kafka.streams.kstream.internals.KTableFilterTest > testSendingOldValue PASSED

org.apache.kafka.streams.kstream.internals.KTableFilterTest > testNotSendingOldValue STARTED

org.apache.kafka.streams.kstream.internals.KTableFilterTest > testNotSendingOldValue PASSED

org.apache.kafka.streams.kstream.internals.KTableFilterTest > testSkipNullOnMaterialization
STARTED

org.apache.kafka.streams.kstream.internals.KTableFilterTest > testSkipNullOnMaterialization
PASSED

org.apache.kafka.streams.kstream.internals.KTableFilterTest > testKTable STARTED

org.apache.kafka.streams.kstream.internals.KTableFilterTest > testKTable PASSED

org.apache.kafka.streams.kstream.internals.KTableFilterTest > testValueGetter STARTED

org.apache.kafka.streams.kstream.internals.KTableFilterTest > testValueGetter PASSED

org.apache.kafka.streams.kstream.internals.KStreamFlatMapTest > testFlatMap STARTED

org.apache.kafka.streams.kstream.internals.KStreamFlatMapTest > testFlatMap PASSED

org.apache.kafka.streams.kstream.internals.KTableAggregateTest > testAggBasic STARTED

org.apache.kafka.streams.kstream.internals.KTableAggregateTest > testAggBasic PASSED

org.apache.kafka.streams.kstream.internals.KTableAggregateTest > testCount STARTED

org.apache.kafka.streams.kstream.internals.KTableAggregateTest > testCount PASSED

org.apache.kafka.streams.kstream.internals.KTableAggregateTest > testAggRepartition STARTED

org.apache.kafka.streams.kstream.internals.KTableAggregateTest > testAggRepartition PASSED

org.apache.kafka.streams.kstream.internals.KTableAggregateTest > testRemoveOldBeforeAddNew
STARTED

org.apache.kafka.streams.kstream.internals.KTableAggregateTest > testRemoveOldBeforeAddNew
PASSED

org.apache.kafka.streams.kstream.internals.KStreamFlatMapValuesTest > testFlatMapValues
STARTED

org.apache.kafka.streams.kstream.internals.KStreamFlatMapValuesTest > testFlatMapValues
PASSED

org.apache.kafka.streams.kstream.internals.KGroupedTableImplTest > shouldNotAllowNullSubtractorOnAggregate
STARTED

org.apache.kafka.streams.kstream.internals.KGroupedTableImplTest > shouldNotAllowNullSubtractorOnAggregate
PASSED

org.apache.kafka.streams.kstream.internals.KGroupedTableImplTest > shouldNotAllowNullInitializerOnAggregate
STARTED

org.apache.kafka.streams.kstream.internals.KGroupedTableImplTest > shouldNotAllowNullInitializerOnAggregate
PASSED

org.apache.kafka.streams.kstream.internals.KGroupedTableImplTest > shouldNotAllowNullStoreNameOnAggregate
STARTED

org.apache.kafka.streams.kstream.internals.KGroupedTableImplTest > shouldNotAllowNullStoreNameOnAggregate
PASSED

org.apache.kafka.streams.kstream.internals.KGroupedTableImplTest > shouldNotAllowNullAdderOnReduce
STARTED

org.apache.kafka.streams.kstream.internals.KGroupedTableImplTest > shouldNotAllowNullAdderOnReduce
PASSED

org.apache.kafka.streams.kstream.internals.KGroupedTableImplTest > shouldNotAllowNullAdderOnAggregate
STARTED

org.apache.kafka.streams.kstream.internals.KGroupedTableImplTest > shouldNotAllowNullAdderOnAggregate
PASSED

org.apache.kafka.streams.kstream.internals.KGroupedTableImplTest > shouldNotAllowNullStoreNameOnReduce
STARTED

org.apache.kafka.streams.kstream.internals.KGroupedTableImplTest > shouldNotAllowNullStoreNameOnReduce
PASSED

org.apache.kafka.streams.kstream.internals.KGroupedTableImplTest > shouldNotAllowNullSubtractorOnReduce
STARTED

org.apache.kafka.streams.kstream.internals.KGroupedTableImplTest > shouldNotAllowNullSubtractorOnReduce
PASSED

org.apache.kafka.streams.kstream.internals.KTableForeachTest > testForeach STARTED

org.apache.kafka.streams.kstream.internals.KTableForeachTest > testForeach PASSED

org.apache.kafka.streams.kstream.UnlimitedWindowsTest > startTimeMustNotBeNegative STARTED

org.apache.kafka.streams.kstream.UnlimitedWindowsTest > startTimeMustNotBeNegative PASSED

org.apache.kafka.streams.kstream.UnlimitedWindowsTest > shouldIncludeRecordsThatHappenedOnWindowStart
STARTED

org.apache.kafka.streams.kstream.UnlimitedWindowsTest > shouldIncludeRecordsThatHappenedOnWindowStart
PASSED

org.apache.kafka.streams.kstream.UnlimitedWindowsTest > startTimeCanBeZero STARTED

org.apache.kafka.streams.kstream.UnlimitedWindowsTest > startTimeCanBeZero PASSED

org.apache.kafka.streams.kstream.UnlimitedWindowsTest > shouldIncludeRecordsThatHappenedAfterWindowStart
STARTED

org.apache.kafka.streams.kstream.UnlimitedWindowsTest > shouldIncludeRecordsThatHappenedAfterWindowStart
PASSED

org.apache.kafka.streams.kstream.UnlimitedWindowsTest > shouldExcludeRecordsThatHappenedBeforeWindowStart
STARTED

org.apache.kafka.streams.kstream.UnlimitedWindowsTest > shouldExcludeRecordsThatHappenedBeforeWindowStart
PASSED

org.apache.kafka.streams.kstream.TimeWindowsTest > shouldHaveSaneEqualsAndHashCode STARTED

org.apache.kafka.streams.kstream.TimeWindowsTest > shouldHaveSaneEqualsAndHashCode PASSED

org.apache.kafka.streams.kstream.TimeWindowsTest > windowSizeMustNotBeZero STARTED

org.apache.kafka.streams.kstream.TimeWindowsTest > windowSizeMustNotBeZero PASSED

org.apache.kafka.streams.kstream.TimeWindowsTest > advanceIntervalMustNotBeZero STARTED

org.apache.kafka.streams.kstream.TimeWindowsTest > advanceIntervalMustNotBeZero PASSED

org.apache.kafka.streams.kstream.TimeWindowsTest > windowSizeMustNotBeNegative STARTED

org.apache.kafka.streams.kstream.TimeWindowsTest > windowSizeMustNotBeNegative PASSED

org.apache.kafka.streams.kstream.TimeWindowsTest > advanceIntervalMustNotBeNegative STARTED

org.apache.kafka.streams.kstream.TimeWindowsTest > advanceIntervalMustNotBeNegative PASSED

org.apache.kafka.streams.kstream.TimeWindowsTest > advanceIntervalMustNotBeLargerThanWindowSize
STARTED

org.apache.kafka.streams.kstream.TimeWindowsTest > advanceIntervalMustNotBeLargerThanWindowSize
PASSED

org.apache.kafka.streams.kstream.TimeWindowsTest > windowsForTumblingWindows STARTED

org.apache.kafka.streams.kstream.TimeWindowsTest > windowsForTumblingWindows PASSED

org.apache.kafka.streams.kstream.TimeWindowsTest > windowsForHoppingWindows STARTED

org.apache.kafka.streams.kstream.TimeWindowsTest > windowsForHoppingWindows PASSED

org.apache.kafka.streams.kstream.TimeWindowsTest > windowsForBarelyOverlappingHoppingWindows
STARTED

org.apache.kafka.streams.kstream.TimeWindowsTest > windowsForBarelyOverlappingHoppingWindows
PASSED

org.apache.kafka.streams.kstream.JoinWindowsTest > afterBelowLower STARTED

org.apache.kafka.streams.kstream.JoinWindowsTest > afterBelowLower PASSED

org.apache.kafka.streams.kstream.JoinWindowsTest > beforeOverUpper STARTED

org.apache.kafka.streams.kstream.JoinWindowsTest > beforeOverUpper PASSED

org.apache.kafka.streams.kstream.JoinWindowsTest > shouldHaveSaneEqualsAndHashCode STARTED

org.apache.kafka.streams.kstream.JoinWindowsTest > shouldHaveSaneEqualsAndHashCode PASSED

org.apache.kafka.streams.kstream.JoinWindowsTest > validWindows STARTED

org.apache.kafka.streams.kstream.JoinWindowsTest > validWindows PASSED

org.apache.kafka.streams.kstream.JoinWindowsTest > timeDifferenceMustNotBeNegative STARTED

org.apache.kafka.streams.kstream.JoinWindowsTest > timeDifferenceMustNotBeNegative PASSED

org.apache.kafka.streams.kstream.KStreamBuilderTest > shouldHaveCorrectSourceTopicsForTableFromMergedStream
STARTED

org.apache.kafka.streams.kstream.KStreamBuilderTest > shouldHaveCorrectSourceTopicsForTableFromMergedStream
PASSED

org.apache.kafka.streams.kstream.KStreamBuilderTest > shouldHaveCorrectSourceTopicsForTableFromMergedStreamWithProcessors
STARTED

org.apache.kafka.streams.kstream.KStreamBuilderTest > shouldHaveCorrectSourceTopicsForTableFromMergedStreamWithProcessors
PASSED

org.apache.kafka.streams.kstream.KStreamBuilderTest > testMerge STARTED

org.apache.kafka.streams.kstream.KStreamBuilderTest > testMerge PASSED

org.apache.kafka.streams.kstream.KStreamBuilderTest > testFrom STARTED

org.apache.kafka.streams.kstream.KStreamBuilderTest > testFrom PASSED

org.apache.kafka.streams.kstream.KStreamBuilderTest > shouldThrowExceptionWhenTopicNamesAreNull
STARTED

org.apache.kafka.streams.kstream.KStreamBuilderTest > shouldThrowExceptionWhenTopicNamesAreNull
PASSED

org.apache.kafka.streams.kstream.KStreamBuilderTest > shouldThrowExceptionWhenNoTopicPresent
STARTED

org.apache.kafka.streams.kstream.KStreamBuilderTest > shouldThrowExceptionWhenNoTopicPresent
PASSED

org.apache.kafka.streams.kstream.KStreamBuilderTest > testNewName STARTED

org.apache.kafka.streams.kstream.KStreamBuilderTest > testNewName PASSED

354 tests completed, 1 failed
:streams:test FAILED

FAILURE: Build failed with an exception.

* What went wrong:
Execution failed for task ':streams:test'.
> There were failing tests. See the report at: file://<https://builds.apache.org/job/kafka-trunk-jdk8/ws/streams/build/reports/tests/index.html>

* Try:
Run with --stacktrace option to get the stack trace. Run with --info or --debug option to
get more log output.

BUILD FAILED

Total time: 1 hrs 21 mins 11.323 secs
Build step 'Execute shell' marked build as failure
Recording test results
Setting GRADLE_2_4_RC_2_HOME=/home/jenkins/jenkins-slave/tools/hudson.plugins.gradle.GradleInstallation/Gradle_2.4-rc-2
Setting GRADLE_2_4_RC_2_HOME=/home/jenkins/jenkins-slave/tools/hudson.plugins.gradle.GradleInstallation/Gradle_2.4-rc-2

Mime
View raw message