kafka-dev mailing list archives

Site index · List index
Message view « Date » · « Thread »
Top « Date » · « Thread »
From Apache Jenkins Server <jenk...@builds.apache.org>
Subject Build failed in Jenkins: kafka-trunk-jdk8 #730
Date Sat, 02 Jul 2016 03:02:54 GMT
See <https://builds.apache.org/job/kafka-trunk-jdk8/730/changes>

Changes:

[ismael] MINOR: remove "auto.commit.interval.ms" from "Manual Offset Control"

[ismael] MINOR: Fix consumer constructor doc string

------------------------------------------
[...truncated 11396 lines...]
org.apache.kafka.streams.processor.TopologyBuilderTest > testAddSinkWithWrongParent STARTED

org.apache.kafka.streams.processor.TopologyBuilderTest > testAddSinkWithWrongParent PASSED

org.apache.kafka.streams.processor.TopologyBuilderTest > testPatternMatchesAlreadyProvidedTopicSource
STARTED

org.apache.kafka.streams.processor.TopologyBuilderTest > testPatternMatchesAlreadyProvidedTopicSource
PASSED

org.apache.kafka.streams.processor.TopologyBuilderTest > testAddSinkConnectedWithMultipleParent
STARTED

org.apache.kafka.streams.processor.TopologyBuilderTest > testAddSinkConnectedWithMultipleParent
PASSED

org.apache.kafka.streams.processor.TopologyBuilderTest > testSubscribeTopicNameAndPattern
STARTED

org.apache.kafka.streams.processor.TopologyBuilderTest > testSubscribeTopicNameAndPattern
PASSED

org.apache.kafka.streams.processor.TopologyBuilderTest > testAddProcessorWithWrongParent
STARTED

org.apache.kafka.streams.processor.TopologyBuilderTest > testAddProcessorWithWrongParent
PASSED

org.apache.kafka.streams.processor.TopologyBuilderTest > testAddStateStore STARTED

org.apache.kafka.streams.processor.TopologyBuilderTest > testAddStateStore PASSED

org.apache.kafka.streams.processor.TopologyBuilderTest > testAddSinkConnectedWithParent
STARTED

org.apache.kafka.streams.processor.TopologyBuilderTest > testAddSinkConnectedWithParent
PASSED

org.apache.kafka.streams.processor.TopologyBuilderTest > testAddStateStoreWithNonExistingProcessor
STARTED

org.apache.kafka.streams.processor.TopologyBuilderTest > testAddStateStoreWithNonExistingProcessor
PASSED

org.apache.kafka.streams.processor.internals.RecordQueueTest > testTimeTracking STARTED

org.apache.kafka.streams.processor.internals.RecordQueueTest > testTimeTracking PASSED

org.apache.kafka.streams.processor.internals.ProcessorStateManagerTest > testRegisterNonPersistentStore
STARTED

org.apache.kafka.streams.processor.internals.ProcessorStateManagerTest > testRegisterNonPersistentStore
PASSED

org.apache.kafka.streams.processor.internals.ProcessorStateManagerTest > testLockStateDirectory
STARTED

org.apache.kafka.streams.processor.internals.ProcessorStateManagerTest > testLockStateDirectory
PASSED

org.apache.kafka.streams.processor.internals.ProcessorStateManagerTest > testGetStore STARTED

org.apache.kafka.streams.processor.internals.ProcessorStateManagerTest > testGetStore PASSED

org.apache.kafka.streams.processor.internals.ProcessorStateManagerTest > testClose STARTED

org.apache.kafka.streams.processor.internals.ProcessorStateManagerTest > testClose PASSED

org.apache.kafka.streams.processor.internals.ProcessorStateManagerTest > testChangeLogOffsets
STARTED

org.apache.kafka.streams.processor.internals.ProcessorStateManagerTest > testChangeLogOffsets
PASSED

org.apache.kafka.streams.processor.internals.ProcessorStateManagerTest > testRegisterPersistentStore
STARTED

org.apache.kafka.streams.processor.internals.ProcessorStateManagerTest > testRegisterPersistentStore
PASSED

org.apache.kafka.streams.processor.internals.ProcessorStateManagerTest > testNoTopic STARTED

org.apache.kafka.streams.processor.internals.ProcessorStateManagerTest > testNoTopic PASSED

org.apache.kafka.streams.processor.internals.QuickUnionTest > testUnite STARTED

org.apache.kafka.streams.processor.internals.QuickUnionTest > testUnite PASSED

org.apache.kafka.streams.processor.internals.QuickUnionTest > testUniteMany STARTED

org.apache.kafka.streams.processor.internals.QuickUnionTest > testUniteMany PASSED

org.apache.kafka.streams.processor.internals.StandbyTaskTest > testStorePartitions STARTED

org.apache.kafka.streams.processor.internals.StandbyTaskTest > testStorePartitions PASSED

org.apache.kafka.streams.processor.internals.StandbyTaskTest > testUpdateKTable STARTED

org.apache.kafka.streams.processor.internals.StandbyTaskTest > testUpdateKTable PASSED

org.apache.kafka.streams.processor.internals.StandbyTaskTest > testUpdateNonPersistentStore
STARTED

org.apache.kafka.streams.processor.internals.StandbyTaskTest > testUpdateNonPersistentStore
PASSED

org.apache.kafka.streams.processor.internals.StandbyTaskTest > testUpdate STARTED

org.apache.kafka.streams.processor.internals.StandbyTaskTest > testUpdate PASSED

org.apache.kafka.streams.processor.internals.PartitionGroupTest > testTimeTracking STARTED

org.apache.kafka.streams.processor.internals.PartitionGroupTest > testTimeTracking PASSED

org.apache.kafka.streams.processor.internals.StreamThreadTest > testInjectClients STARTED

org.apache.kafka.streams.processor.internals.StreamThreadTest > testInjectClients PASSED

org.apache.kafka.streams.processor.internals.StreamThreadTest > testMaybeCommit STARTED

org.apache.kafka.streams.processor.internals.StreamThreadTest > testMaybeCommit PASSED

org.apache.kafka.streams.processor.internals.StreamThreadTest > testPartitionAssignmentChange
STARTED

org.apache.kafka.streams.processor.internals.StreamThreadTest > testPartitionAssignmentChange
PASSED

org.apache.kafka.streams.processor.internals.StreamThreadTest > testMaybeClean STARTED

org.apache.kafka.streams.processor.internals.StreamThreadTest > testMaybeClean PASSED

org.apache.kafka.streams.processor.internals.MinTimestampTrackerTest > testTracking STARTED

org.apache.kafka.streams.processor.internals.MinTimestampTrackerTest > testTracking PASSED

org.apache.kafka.streams.processor.internals.StreamTaskTest > testProcessOrder STARTED

org.apache.kafka.streams.processor.internals.StreamTaskTest > testProcessOrder PASSED

org.apache.kafka.streams.processor.internals.StreamTaskTest > testPauseResume STARTED

org.apache.kafka.streams.processor.internals.StreamTaskTest > testPauseResume PASSED

org.apache.kafka.streams.processor.internals.StreamTaskTest > testMaybePunctuate STARTED

org.apache.kafka.streams.processor.internals.StreamTaskTest > testMaybePunctuate PASSED

org.apache.kafka.streams.processor.internals.assignment.AssginmentInfoTest > testEncodeDecode
STARTED

org.apache.kafka.streams.processor.internals.assignment.AssginmentInfoTest > testEncodeDecode
PASSED

org.apache.kafka.streams.processor.internals.assignment.SubscriptionInfoTest > testEncodeDecode
STARTED

org.apache.kafka.streams.processor.internals.assignment.SubscriptionInfoTest > testEncodeDecode
PASSED

org.apache.kafka.streams.processor.internals.assignment.TaskAssignorTest > testStickiness
STARTED

org.apache.kafka.streams.processor.internals.assignment.TaskAssignorTest > testStickiness
PASSED

org.apache.kafka.streams.processor.internals.assignment.TaskAssignorTest > testAssignWithStandby
STARTED

org.apache.kafka.streams.processor.internals.assignment.TaskAssignorTest > testAssignWithStandby
PASSED

org.apache.kafka.streams.processor.internals.assignment.TaskAssignorTest > testAssignWithoutStandby
STARTED

org.apache.kafka.streams.processor.internals.assignment.TaskAssignorTest > testAssignWithoutStandby
PASSED

org.apache.kafka.streams.processor.internals.ProcessorTopologyTest > testDrivingMultiplexingTopology
STARTED

org.apache.kafka.streams.processor.internals.ProcessorTopologyTest > testDrivingMultiplexingTopology
PASSED

org.apache.kafka.streams.processor.internals.ProcessorTopologyTest > testDrivingStatefulTopology
STARTED

org.apache.kafka.streams.processor.internals.ProcessorTopologyTest > testDrivingStatefulTopology
PASSED

org.apache.kafka.streams.processor.internals.ProcessorTopologyTest > testDrivingSimpleTopology
STARTED

org.apache.kafka.streams.processor.internals.ProcessorTopologyTest > testDrivingSimpleTopology
PASSED

org.apache.kafka.streams.processor.internals.ProcessorTopologyTest > testTopologyMetadata
STARTED

org.apache.kafka.streams.processor.internals.ProcessorTopologyTest > testTopologyMetadata
PASSED

org.apache.kafka.streams.processor.internals.ProcessorTopologyTest > testDrivingMultiplexByNameTopology
STARTED

org.apache.kafka.streams.processor.internals.ProcessorTopologyTest > testDrivingMultiplexByNameTopology
PASSED

org.apache.kafka.streams.processor.internals.RecordCollectorTest > testSpecificPartition
STARTED

org.apache.kafka.streams.processor.internals.RecordCollectorTest > testSpecificPartition
PASSED

org.apache.kafka.streams.processor.internals.RecordCollectorTest > testStreamPartitioner
STARTED

org.apache.kafka.streams.processor.internals.RecordCollectorTest > testStreamPartitioner
PASSED

org.apache.kafka.streams.processor.internals.PunctuationQueueTest > testPunctuationInterval
STARTED

org.apache.kafka.streams.processor.internals.PunctuationQueueTest > testPunctuationInterval
PASSED

org.apache.kafka.streams.processor.internals.StreamPartitionAssignorTest > testAssignWithStandbyReplicas
STARTED

org.apache.kafka.streams.processor.internals.StreamPartitionAssignorTest > testAssignWithStandbyReplicas
PASSED

org.apache.kafka.streams.processor.internals.StreamPartitionAssignorTest > testAssignWithNewTasks
STARTED

org.apache.kafka.streams.processor.internals.StreamPartitionAssignorTest > testAssignWithNewTasks
PASSED

org.apache.kafka.streams.processor.internals.StreamPartitionAssignorTest > testAssignWithStates
STARTED

org.apache.kafka.streams.processor.internals.StreamPartitionAssignorTest > testAssignWithStates
PASSED

org.apache.kafka.streams.processor.internals.StreamPartitionAssignorTest > testAssignBasic
STARTED

org.apache.kafka.streams.processor.internals.StreamPartitionAssignorTest > testAssignBasic
PASSED

org.apache.kafka.streams.processor.internals.StreamPartitionAssignorTest > testOnAssignment
STARTED

org.apache.kafka.streams.processor.internals.StreamPartitionAssignorTest > testOnAssignment
PASSED

org.apache.kafka.streams.processor.internals.StreamPartitionAssignorTest > testAssignWithInternalTopicThatsSourceIsAnotherInternalTopic
STARTED

org.apache.kafka.streams.processor.internals.StreamPartitionAssignorTest > testAssignWithInternalTopicThatsSourceIsAnotherInternalTopic
PASSED

org.apache.kafka.streams.processor.internals.StreamPartitionAssignorTest > testSubscription
STARTED

org.apache.kafka.streams.processor.internals.StreamPartitionAssignorTest > testSubscription
PASSED

org.apache.kafka.streams.processor.internals.StreamPartitionAssignorTest > testAssignWithInternalTopics
STARTED

org.apache.kafka.streams.processor.internals.StreamPartitionAssignorTest > testAssignWithInternalTopics
PASSED

org.apache.kafka.streams.KafkaStreamsTest > testCannotStartOnceClosed STARTED

org.apache.kafka.streams.KafkaStreamsTest > testCannotStartOnceClosed PASSED

org.apache.kafka.streams.KafkaStreamsTest > testStartAndClose STARTED

org.apache.kafka.streams.KafkaStreamsTest > testStartAndClose PASSED

org.apache.kafka.streams.KafkaStreamsTest > testCloseIsIdempotent STARTED

org.apache.kafka.streams.KafkaStreamsTest > testCloseIsIdempotent PASSED

org.apache.kafka.streams.KafkaStreamsTest > testCannotStartTwice STARTED

org.apache.kafka.streams.KafkaStreamsTest > testCannotStartTwice PASSED

org.apache.kafka.streams.KeyValueTest > shouldHaveSaneEqualsAndHashCode STARTED

org.apache.kafka.streams.KeyValueTest > shouldHaveSaneEqualsAndHashCode PASSED

210 tests completed, 1 failed
:streams:test FAILED

FAILURE: Build failed with an exception.

* What went wrong:
Execution failed for task ':streams:test'.
> There were failing tests. See the report at: file://<https://builds.apache.org/job/kafka-trunk-jdk8/ws/streams/build/reports/tests/index.html>

* Try:
Run with --stacktrace option to get the stack trace. Run with --info or --debug option to
get more log output.

BUILD FAILED

Total time: 1 hrs 49 mins 56.734 secs
Build step 'Execute shell' marked build as failure
Recording test results
Setting GRADLE_2_4_RC_2_HOME=/home/jenkins/jenkins-slave/tools/hudson.plugins.gradle.GradleInstallation/Gradle_2.4-rc-2
Setting JDK1_8_0_66_HOME=/home/jenkins/jenkins-slave/tools/hudson.model.JDK/jdk1.8.0_66
Setting GRADLE_2_4_RC_2_HOME=/home/jenkins/jenkins-slave/tools/hudson.plugins.gradle.GradleInstallation/Gradle_2.4-rc-2
Setting JDK1_8_0_66_HOME=/home/jenkins/jenkins-slave/tools/hudson.model.JDK/jdk1.8.0_66

Mime
View raw message