kafka-dev mailing list archives

Site index · List index
Message view « Date » · « Thread »
Top « Date » · « Thread »
From Apache Jenkins Server <jenk...@builds.apache.org>
Subject Build failed in Jenkins: kafka-trunk-jdk8 #759
Date Wed, 20 Jul 2016 05:37:45 GMT
See <https://builds.apache.org/job/kafka-trunk-jdk8/759/changes>

Changes:

[cshapi] MINOR: Remove unused parameter in

------------------------------------------
[...truncated 4653 lines...]

kafka.server.LogRecoveryTest > testHWCheckpointWithFailuresSingleLogSegment PASSED

kafka.server.AbstractFetcherThreadTest > testConsumerLagRemovedWithPartition STARTED

kafka.server.AbstractFetcherThreadTest > testConsumerLagRemovedWithPartition PASSED

kafka.server.AbstractFetcherThreadTest > testMetricsRemovedOnShutdown STARTED

kafka.server.AbstractFetcherThreadTest > testMetricsRemovedOnShutdown PASSED

kafka.server.ServerShutdownTest > testCleanShutdownAfterFailedStartup STARTED

kafka.server.ServerShutdownTest > testCleanShutdownAfterFailedStartup PASSED

kafka.server.ServerShutdownTest > testConsecutiveShutdown STARTED

kafka.server.ServerShutdownTest > testConsecutiveShutdown PASSED

kafka.server.ServerShutdownTest > testCleanShutdown STARTED

kafka.server.ServerShutdownTest > testCleanShutdown PASSED

kafka.server.ServerShutdownTest > testCleanShutdownWithDeleteTopicEnabled STARTED

kafka.server.ServerShutdownTest > testCleanShutdownWithDeleteTopicEnabled PASSED

kafka.server.ServerStartupTest > testBrokerStateRunningAfterZK STARTED

kafka.server.ServerStartupTest > testBrokerStateRunningAfterZK PASSED

kafka.server.ServerStartupTest > testBrokerCreatesZKChroot STARTED

kafka.server.ServerStartupTest > testBrokerCreatesZKChroot PASSED

kafka.server.ServerStartupTest > testConflictBrokerRegistration STARTED

kafka.server.ServerStartupTest > testConflictBrokerRegistration PASSED

kafka.server.ServerStartupTest > testBrokerSelfAware STARTED

kafka.server.ServerStartupTest > testBrokerSelfAware PASSED

kafka.server.EdgeCaseRequestTest > testInvalidApiVersionRequest STARTED

kafka.server.EdgeCaseRequestTest > testInvalidApiVersionRequest PASSED

kafka.server.EdgeCaseRequestTest > testMalformedHeaderRequest STARTED

kafka.server.EdgeCaseRequestTest > testMalformedHeaderRequest PASSED

kafka.server.EdgeCaseRequestTest > testProduceRequestWithNullClientId STARTED

kafka.server.EdgeCaseRequestTest > testProduceRequestWithNullClientId PASSED

kafka.server.EdgeCaseRequestTest > testInvalidApiKeyRequest STARTED

kafka.server.EdgeCaseRequestTest > testInvalidApiKeyRequest PASSED

kafka.server.EdgeCaseRequestTest > testHeaderOnlyRequest STARTED

kafka.server.EdgeCaseRequestTest > testHeaderOnlyRequest PASSED

kafka.server.CreateTopicsRequestTest > testValidCreateTopicsRequests STARTED

kafka.server.CreateTopicsRequestTest > testValidCreateTopicsRequests PASSED

kafka.server.CreateTopicsRequestTest > testErrorCreateTopicsRequests STARTED

kafka.server.CreateTopicsRequestTest > testErrorCreateTopicsRequests PASSED

kafka.server.CreateTopicsRequestTest > testInvalidCreateTopicsRequests STARTED

kafka.server.CreateTopicsRequestTest > testInvalidCreateTopicsRequests PASSED

kafka.server.CreateTopicsRequestTest > testNotController STARTED

kafka.server.CreateTopicsRequestTest > testNotController PASSED

kafka.server.OffsetCommitTest > testUpdateOffsets STARTED

kafka.server.OffsetCommitTest > testUpdateOffsets PASSED

kafka.server.OffsetCommitTest > testLargeMetadataPayload STARTED

kafka.server.OffsetCommitTest > testLargeMetadataPayload PASSED

kafka.server.OffsetCommitTest > testCommitAndFetchOffsets STARTED

kafka.server.OffsetCommitTest > testCommitAndFetchOffsets PASSED

kafka.server.OffsetCommitTest > testOffsetExpiration STARTED

kafka.server.OffsetCommitTest > testOffsetExpiration PASSED

kafka.server.OffsetCommitTest > testNonExistingTopicOffsetCommit STARTED

kafka.server.OffsetCommitTest > testNonExistingTopicOffsetCommit PASSED

kafka.server.ReplicaManagerTest > testHighWaterMarkDirectoryMapping STARTED

kafka.server.ReplicaManagerTest > testHighWaterMarkDirectoryMapping PASSED

kafka.server.ReplicaManagerTest > testFetchBeyondHighWatermarkReturnEmptyResponse STARTED

kafka.server.ReplicaManagerTest > testFetchBeyondHighWatermarkReturnEmptyResponse PASSED

kafka.server.ReplicaManagerTest > testIllegalRequiredAcks STARTED

kafka.server.ReplicaManagerTest > testIllegalRequiredAcks PASSED

kafka.server.ReplicaManagerTest > testClearPurgatoryOnBecomingFollower STARTED

kafka.server.ReplicaManagerTest > testClearPurgatoryOnBecomingFollower PASSED

kafka.server.ReplicaManagerTest > testHighwaterMarkRelativeDirectoryMapping STARTED

kafka.server.ReplicaManagerTest > testHighwaterMarkRelativeDirectoryMapping PASSED

kafka.server.IsrExpirationTest > testIsrExpirationForSlowFollowers STARTED

kafka.server.IsrExpirationTest > testIsrExpirationForSlowFollowers PASSED

kafka.server.IsrExpirationTest > testIsrExpirationForStuckFollowers STARTED

kafka.server.IsrExpirationTest > testIsrExpirationForStuckFollowers PASSED

kafka.server.IsrExpirationTest > testIsrExpirationIfNoFetchRequestMade STARTED

kafka.server.IsrExpirationTest > testIsrExpirationIfNoFetchRequestMade PASSED

kafka.server.ControlledShutdownLeaderSelectorTest > testSelectLeader STARTED

kafka.server.ControlledShutdownLeaderSelectorTest > testSelectLeader PASSED

kafka.server.ClientQuotaManagerTest > testQuotaViolation STARTED

kafka.server.ClientQuotaManagerTest > testQuotaViolation PASSED

kafka.server.ClientQuotaManagerTest > testExpireQuotaSensors STARTED

kafka.server.ClientQuotaManagerTest > testExpireQuotaSensors PASSED

kafka.server.ClientQuotaManagerTest > testExpireThrottleTimeSensor STARTED

kafka.server.ClientQuotaManagerTest > testExpireThrottleTimeSensor PASSED

kafka.server.ClientQuotaManagerTest > testQuotaParsing STARTED

kafka.server.ClientQuotaManagerTest > testQuotaParsing PASSED

kafka.server.MetadataCacheTest > getTopicMetadataWithNonSupportedSecurityProtocol STARTED

kafka.server.MetadataCacheTest > getTopicMetadataWithNonSupportedSecurityProtocol PASSED

kafka.server.MetadataCacheTest > getTopicMetadataIsrNotAvailable STARTED

kafka.server.MetadataCacheTest > getTopicMetadataIsrNotAvailable PASSED

kafka.server.MetadataCacheTest > getTopicMetadata STARTED

kafka.server.MetadataCacheTest > getTopicMetadata PASSED

kafka.server.MetadataCacheTest > getTopicMetadataReplicaNotAvailable STARTED

kafka.server.MetadataCacheTest > getTopicMetadataReplicaNotAvailable PASSED

kafka.server.MetadataCacheTest > getTopicMetadataPartitionLeaderNotAvailable STARTED

kafka.server.MetadataCacheTest > getTopicMetadataPartitionLeaderNotAvailable PASSED

kafka.server.MetadataCacheTest > getAliveBrokersShouldNotBeMutatedByUpdateCache STARTED

kafka.server.MetadataCacheTest > getAliveBrokersShouldNotBeMutatedByUpdateCache PASSED

kafka.server.MetadataCacheTest > getTopicMetadataNonExistingTopics STARTED

kafka.server.MetadataCacheTest > getTopicMetadataNonExistingTopics PASSED

kafka.server.ServerGenerateBrokerIdTest > testGetSequenceIdMethod STARTED

kafka.server.ServerGenerateBrokerIdTest > testGetSequenceIdMethod PASSED

kafka.server.ServerGenerateBrokerIdTest > testBrokerMetadataOnIdCollision STARTED

kafka.server.ServerGenerateBrokerIdTest > testBrokerMetadataOnIdCollision PASSED

kafka.server.ServerGenerateBrokerIdTest > testAutoGenerateBrokerId STARTED

kafka.server.ServerGenerateBrokerIdTest > testAutoGenerateBrokerId PASSED

kafka.server.ServerGenerateBrokerIdTest > testMultipleLogDirsMetaProps STARTED

kafka.server.ServerGenerateBrokerIdTest > testMultipleLogDirsMetaProps PASSED

kafka.server.ServerGenerateBrokerIdTest > testDisableGeneratedBrokerId STARTED

kafka.server.ServerGenerateBrokerIdTest > testDisableGeneratedBrokerId PASSED

kafka.server.ServerGenerateBrokerIdTest > testUserConfigAndGeneratedBrokerId STARTED

kafka.server.ServerGenerateBrokerIdTest > testUserConfigAndGeneratedBrokerId PASSED

kafka.server.ServerGenerateBrokerIdTest > testConsistentBrokerIdFromUserConfigAndMetaProps
STARTED

kafka.server.ServerGenerateBrokerIdTest > testConsistentBrokerIdFromUserConfigAndMetaProps
PASSED

kafka.server.ApiVersionsRequestTest > testApiVersionsRequestWithUnsupportedVersion STARTED

kafka.server.ApiVersionsRequestTest > testApiVersionsRequestWithUnsupportedVersion PASSED

kafka.server.ApiVersionsRequestTest > testApiVersionsRequest STARTED

kafka.server.ApiVersionsRequestTest > testApiVersionsRequest PASSED

kafka.server.LogOffsetTest > testFetchOffsetsBeforeWithChangingSegmentSize STARTED

kafka.server.LogOffsetTest > testFetchOffsetsBeforeWithChangingSegmentSize PASSED

kafka.server.LogOffsetTest > testGetOffsetsBeforeEarliestTime STARTED

kafka.server.LogOffsetTest > testGetOffsetsBeforeEarliestTime PASSED

kafka.server.LogOffsetTest > testGetOffsetsForUnknownTopic STARTED

kafka.server.LogOffsetTest > testGetOffsetsForUnknownTopic PASSED

kafka.server.LogOffsetTest > testEmptyLogsGetOffsets STARTED
:kafka-trunk-jdk8:core:test FAILED
:test_core_2_11 FAILED

FAILURE: Build failed with an exception.

* What went wrong:
Execution failed for task ':core:test'.
> Process 'Gradle Test Executor 2' finished with non-zero exit value 137

* Try:
Run with --stacktrace option to get the stack trace. Run with --info or --debug option to
get more log output.

BUILD FAILED

Total time: 44 mins 50.773 secs
Build step 'Execute shell' marked build as failure
Recording test results
Setting GRADLE_2_4_RC_2_HOME=/home/jenkins/jenkins-slave/tools/hudson.plugins.gradle.GradleInstallation/Gradle_2.4-rc-2
Setting JDK1_8_0_66_HOME=/home/jenkins/jenkins-slave/tools/hudson.model.JDK/jdk1.8.0_66
Setting GRADLE_2_4_RC_2_HOME=/home/jenkins/jenkins-slave/tools/hudson.plugins.gradle.GradleInstallation/Gradle_2.4-rc-2
Setting JDK1_8_0_66_HOME=/home/jenkins/jenkins-slave/tools/hudson.model.JDK/jdk1.8.0_66

Mime
View raw message