kafka-dev mailing list archives

Site index · List index
Message view « Date » · « Thread »
Top « Date » · « Thread »
From Apache Jenkins Server <jenk...@builds.apache.org>
Subject Build failed in Jenkins: kafka-0.10.0-jdk7 #145
Date Fri, 08 Jul 2016 17:04:14 GMT
See <https://builds.apache.org/job/kafka-0.10.0-jdk7/145/changes>

Changes:

[wangguoz] KAFKA-3887: KAFKA-3817 follow-up to avoid forwarding value if it is

------------------------------------------
[...truncated 1670 lines...]

kafka.integration.SaslPlaintextTopicMetadataTest > testBasicTopicMetadata PASSED

kafka.integration.SaslPlaintextTopicMetadataTest > testAliveBrokersListWithNoTopicsAfterABrokerShutdown
PASSED

kafka.KafkaTest > testGetKafkaConfigFromArgsWrongSetValue PASSED

kafka.KafkaTest > testKafkaSslPasswords PASSED

kafka.KafkaTest > testGetKafkaConfigFromArgs PASSED

kafka.KafkaTest > testGetKafkaConfigFromArgsNonArgsAtTheEnd PASSED

kafka.KafkaTest > testGetKafkaConfigFromArgsNonArgsOnly PASSED

kafka.KafkaTest > testGetKafkaConfigFromArgsNonArgsAtTheBegging PASSED

kafka.metrics.MetricsTest > testMetricsReporterAfterDeletingTopic PASSED

kafka.metrics.MetricsTest > testBrokerTopicMetricsUnregisteredAfterDeletingTopic PASSED

kafka.metrics.MetricsTest > testMetricsLeak PASSED

kafka.metrics.KafkaTimerTest > testKafkaTimer PASSED

kafka.utils.UtilsTest > testAbs PASSED

kafka.utils.UtilsTest > testReplaceSuffix PASSED

kafka.utils.UtilsTest > testCircularIterator PASSED

kafka.utils.UtilsTest > testReadBytes PASSED

kafka.utils.UtilsTest > testCsvList PASSED

kafka.utils.UtilsTest > testReadInt PASSED

kafka.utils.UtilsTest > testCsvMap PASSED

kafka.utils.UtilsTest > testInLock PASSED

kafka.utils.UtilsTest > testSwallow PASSED

kafka.utils.SchedulerTest > testMockSchedulerNonPeriodicTask PASSED

kafka.utils.SchedulerTest > testMockSchedulerPeriodicTask PASSED

kafka.utils.SchedulerTest > testNonPeriodicTask PASSED

kafka.utils.SchedulerTest > testRestart PASSED

kafka.utils.SchedulerTest > testReentrantTaskInMockScheduler PASSED

kafka.utils.SchedulerTest > testPeriodicTask PASSED

kafka.utils.ZkUtilsTest > testAbortedConditionalDeletePath PASSED

kafka.utils.ZkUtilsTest > testSuccessfulConditionalDeletePath PASSED

kafka.utils.ByteBoundedBlockingQueueTest > testByteBoundedBlockingQueue PASSED

kafka.utils.timer.TimerTaskListTest > testAll PASSED

kafka.utils.timer.TimerTest > testAlreadyExpiredTask PASSED

kafka.utils.timer.TimerTest > testTaskExpiration PASSED

kafka.utils.CommandLineUtilsTest > testParseEmptyArg PASSED

kafka.utils.CommandLineUtilsTest > testParseSingleArg PASSED

kafka.utils.CommandLineUtilsTest > testParseArgs PASSED

kafka.utils.CommandLineUtilsTest > testParseEmptyArgAsValid PASSED

kafka.utils.IteratorTemplateTest > testIterator PASSED

kafka.utils.ReplicationUtilsTest > testUpdateLeaderAndIsr PASSED

kafka.utils.ReplicationUtilsTest > testGetLeaderIsrAndEpochForPartition PASSED

kafka.utils.JsonTest > testJsonEncoding PASSED

kafka.message.MessageCompressionTest > testCompressSize PASSED

kafka.message.MessageCompressionTest > testLZ4FramingV0 PASSED

kafka.message.MessageCompressionTest > testLZ4FramingV1 PASSED

kafka.message.MessageCompressionTest > testSimpleCompressDecompress PASSED

kafka.message.MessageWriterTest > testWithNoCompressionAttribute PASSED

kafka.message.MessageWriterTest > testWithCompressionAttribute PASSED

kafka.message.MessageWriterTest > testBufferingOutputStream PASSED

kafka.message.MessageWriterTest > testWithKey PASSED

kafka.message.MessageTest > testChecksum PASSED

kafka.message.MessageTest > testInvalidTimestamp PASSED

kafka.message.MessageTest > testIsHashable PASSED

kafka.message.MessageTest > testInvalidTimestampAndMagicValueCombination PASSED

kafka.message.MessageTest > testExceptionMapping PASSED

kafka.message.MessageTest > testFieldValues PASSED

kafka.message.MessageTest > testInvalidMagicByte PASSED

kafka.message.MessageTest > testEquality PASSED

kafka.message.MessageTest > testMessageFormatConversion PASSED

kafka.message.ByteBufferMessageSetTest > testMessageWithProvidedOffsetSeq PASSED

kafka.message.ByteBufferMessageSetTest > testValidBytes PASSED

kafka.message.ByteBufferMessageSetTest > testValidBytesWithCompression PASSED

kafka.message.ByteBufferMessageSetTest > testOffsetAssignmentAfterMessageFormatConversion
PASSED

kafka.message.ByteBufferMessageSetTest > testIteratorIsConsistent PASSED

kafka.message.ByteBufferMessageSetTest > testAbsoluteOffsetAssignment PASSED

kafka.message.ByteBufferMessageSetTest > testCreateTime PASSED

kafka.message.ByteBufferMessageSetTest > testInvalidCreateTime PASSED

kafka.message.ByteBufferMessageSetTest > testWrittenEqualsRead PASSED

kafka.message.ByteBufferMessageSetTest > testLogAppendTime PASSED

kafka.message.ByteBufferMessageSetTest > testWriteTo PASSED

kafka.message.ByteBufferMessageSetTest > testEquals PASSED

kafka.message.ByteBufferMessageSetTest > testSizeInBytes PASSED

kafka.message.ByteBufferMessageSetTest > testIterator PASSED

kafka.message.ByteBufferMessageSetTest > testRelativeOffsetAssignment PASSED

kafka.tools.ConsoleConsumerTest > shouldLimitReadsToMaxMessageLimit PASSED

kafka.tools.ConsoleConsumerTest > shouldParseValidNewConsumerValidConfig PASSED

kafka.tools.ConsoleConsumerTest > shouldParseConfigsFromFile PASSED

kafka.tools.ConsoleConsumerTest > shouldParseValidOldConsumerValidConfig PASSED

kafka.tools.MirrorMakerTest > testDefaultMirrorMakerMessageHandler PASSED

kafka.tools.ConsoleProducerTest > testParseKeyProp PASSED

kafka.tools.ConsoleProducerTest > testValidConfigsOldProducer PASSED

kafka.tools.ConsoleProducerTest > testInvalidConfigs PASSED

kafka.tools.ConsoleProducerTest > testValidConfigsNewProducer PASSED

kafka.network.SocketServerTest > testClientDisconnectionUpdatesRequestMetrics PASSED

kafka.network.SocketServerTest > testMaxConnectionsPerIp PASSED

kafka.network.SocketServerTest > testBrokerSendAfterChannelClosedUpdatesRequestMetrics
PASSED

kafka.network.SocketServerTest > simpleRequest PASSED

kafka.network.SocketServerTest > testSessionPrincipal PASSED

kafka.network.SocketServerTest > testMaxConnectionsPerIpOverrides PASSED

kafka.network.SocketServerTest > testSocketsCloseOnShutdown PASSED

kafka.network.SocketServerTest > testSslSocketServer PASSED

kafka.network.SocketServerTest > tooBigRequestIsRejected PASSED

kafka.zk.ZKPathTest > testCreatePersistentSequentialThrowsException PASSED

kafka.zk.ZKPathTest > testCreatePersistentSequentialExists PASSED

kafka.zk.ZKPathTest > testCreateEphemeralPathExists PASSED

kafka.zk.ZKPathTest > testCreatePersistentPath PASSED

kafka.zk.ZKPathTest > testMakeSurePersistsPathExistsThrowsException PASSED

kafka.zk.ZKPathTest > testCreateEphemeralPathThrowsException PASSED

kafka.zk.ZKPathTest > testCreatePersistentPathThrowsException PASSED

kafka.zk.ZKPathTest > testMakeSurePersistsPathExists PASSED

kafka.zk.ZKEphemeralTest > testOverlappingSessions[0] PASSED

kafka.zk.ZKEphemeralTest > testEphemeralNodeCleanup[0] PASSED

kafka.zk.ZKEphemeralTest > testZkWatchedEphemeral[0] PASSED

kafka.zk.ZKEphemeralTest > testSameSession[0] PASSED

kafka.zk.ZKEphemeralTest > testOverlappingSessions[1] PASSED

kafka.zk.ZKEphemeralTest > testEphemeralNodeCleanup[1] PASSED

kafka.zk.ZKEphemeralTest > testZkWatchedEphemeral[1] PASSED

kafka.zk.ZKEphemeralTest > testSameSession[1] PASSED

kafka.common.ConfigTest > testInvalidGroupIds PASSED

kafka.common.ConfigTest > testInvalidClientIds PASSED

kafka.common.TopicTest > testInvalidTopicNames PASSED

kafka.common.TopicTest > testTopicHasCollision PASSED

kafka.common.TopicTest > testTopicHasCollisionChars PASSED

kafka.common.ZkNodeChangeNotificationListenerTest > testProcessNotification PASSED

785 tests completed, 1 failed
:kafka-0.10.0-jdk7:core:test FAILED
:test_core_2_10 FAILED

FAILURE: Build failed with an exception.

* What went wrong:
Execution failed for task ':core:test'.
> There were failing tests. See the report at: file:///x1/jenkins/jenkins-slave/workspace/kafka-0.10.0-jdk7/core/build/reports/tests/index.html

* Try:
Run with --stacktrace option to get the stack trace. Run with --info or --debug option to
get more log output.

BUILD FAILED

Total time: 41 mins 44.779 secs
Build step 'Execute shell' marked build as failure
Recording test results
Setting GRADLE_2_4_RC_2_HOME=/home/jenkins/jenkins-slave/tools/hudson.plugins.gradle.GradleInstallation/Gradle_2.4-rc-2
Setting JDK_1_7U51_HOME=/home/jenkins/jenkins-slave/tools/hudson.model.JDK/jdk-1.7u51
Setting GRADLE_2_4_RC_2_HOME=/home/jenkins/jenkins-slave/tools/hudson.plugins.gradle.GradleInstallation/Gradle_2.4-rc-2
Setting JDK_1_7U51_HOME=/home/jenkins/jenkins-slave/tools/hudson.model.JDK/jdk-1.7u51

Mime
View raw message