kafka-dev mailing list archives

Site index · List index
Message view « Date » · « Thread »
Top « Date » · « Thread »
From Apache Jenkins Server <jenk...@builds.apache.org>
Subject Build failed in Jenkins: kafka-trunk-jdk7 #1438
Date Sat, 23 Jul 2016 11:38:31 GMT
See <https://builds.apache.org/job/kafka-trunk-jdk7/1438/changes>

Changes:

[ismael] KAFKA-3960; Committed offset not set after first assign

------------------------------------------
[...truncated 13022 lines...]

org.apache.kafka.clients.consumer.KafkaConsumerTest > verifyHeartbeatSentWhenFetchedDataReady
STARTED

org.apache.kafka.clients.consumer.KafkaConsumerTest > verifyHeartbeatSentWhenFetchedDataReady
PASSED

org.apache.kafka.clients.consumer.KafkaConsumerTest > testAssignOnEmptyTopicPartition STARTED

org.apache.kafka.clients.consumer.KafkaConsumerTest > testAssignOnEmptyTopicPartition PASSED

org.apache.kafka.clients.consumer.KafkaConsumerTest > testSubscriptionOnNullTopic STARTED

org.apache.kafka.clients.consumer.KafkaConsumerTest > testSubscriptionOnNullTopic PASSED

org.apache.kafka.clients.consumer.KafkaConsumerTest > testSubscription STARTED

org.apache.kafka.clients.consumer.KafkaConsumerTest > testSubscription PASSED

org.apache.kafka.clients.consumer.KafkaConsumerTest > testInterceptorConstructorClose STARTED

org.apache.kafka.clients.consumer.KafkaConsumerTest > testInterceptorConstructorClose PASSED

org.apache.kafka.clients.consumer.KafkaConsumerTest > testSubscriptionOnEmptyTopic STARTED

org.apache.kafka.clients.consumer.KafkaConsumerTest > testSubscriptionOnEmptyTopic PASSED

org.apache.kafka.clients.consumer.KafkaConsumerTest > testWakeupWithFetchDataAvailable
STARTED

org.apache.kafka.clients.consumer.KafkaConsumerTest > testWakeupWithFetchDataAvailable
PASSED

org.apache.kafka.clients.consumer.KafkaConsumerTest > testSubscriptionOnNullTopicCollection
STARTED

org.apache.kafka.clients.consumer.KafkaConsumerTest > testSubscriptionOnNullTopicCollection
PASSED

org.apache.kafka.clients.consumer.ConsumerConfigTest > testDeserializerToPropertyConfig
STARTED

org.apache.kafka.clients.consumer.ConsumerConfigTest > testDeserializerToPropertyConfig
PASSED

org.apache.kafka.clients.consumer.ConsumerConfigTest > testDeserializerToMapConfig STARTED

org.apache.kafka.clients.consumer.ConsumerConfigTest > testDeserializerToMapConfig PASSED

org.apache.kafka.clients.consumer.RoundRobinAssignorTest > testOneConsumerNoTopic STARTED

org.apache.kafka.clients.consumer.RoundRobinAssignorTest > testOneConsumerNoTopic PASSED

org.apache.kafka.clients.consumer.RoundRobinAssignorTest > testTwoConsumersTwoTopicsSixPartitions
STARTED

org.apache.kafka.clients.consumer.RoundRobinAssignorTest > testTwoConsumersTwoTopicsSixPartitions
PASSED

org.apache.kafka.clients.consumer.RoundRobinAssignorTest > testOneConsumerOneTopic STARTED

org.apache.kafka.clients.consumer.RoundRobinAssignorTest > testOneConsumerOneTopic PASSED

org.apache.kafka.clients.consumer.RoundRobinAssignorTest > testMultipleConsumersMixedTopics
STARTED

org.apache.kafka.clients.consumer.RoundRobinAssignorTest > testMultipleConsumersMixedTopics
PASSED

org.apache.kafka.clients.consumer.RoundRobinAssignorTest > testTwoConsumersOneTopicOnePartition
STARTED

org.apache.kafka.clients.consumer.RoundRobinAssignorTest > testTwoConsumersOneTopicOnePartition
PASSED

org.apache.kafka.clients.consumer.RoundRobinAssignorTest > testOneConsumerMultipleTopics
STARTED

org.apache.kafka.clients.consumer.RoundRobinAssignorTest > testOneConsumerMultipleTopics
PASSED

org.apache.kafka.clients.consumer.RoundRobinAssignorTest > testOnlyAssignsPartitionsFromSubscribedTopics
STARTED

org.apache.kafka.clients.consumer.RoundRobinAssignorTest > testOnlyAssignsPartitionsFromSubscribedTopics
PASSED

org.apache.kafka.clients.consumer.RoundRobinAssignorTest > testTwoConsumersOneTopicTwoPartitions
STARTED

org.apache.kafka.clients.consumer.RoundRobinAssignorTest > testTwoConsumersOneTopicTwoPartitions
PASSED

org.apache.kafka.clients.consumer.RoundRobinAssignorTest > testOneConsumerNonexistentTopic
STARTED

org.apache.kafka.clients.consumer.RoundRobinAssignorTest > testOneConsumerNonexistentTopic
PASSED

org.apache.kafka.clients.consumer.MockConsumerTest > testSimpleMock STARTED

org.apache.kafka.clients.consumer.MockConsumerTest > testSimpleMock PASSED

org.apache.kafka.clients.consumer.SerializeCompatibilityOffsetAndMetadataTest > testSerializationRoundtrip
STARTED

org.apache.kafka.clients.consumer.SerializeCompatibilityOffsetAndMetadataTest > testSerializationRoundtrip
PASSED

org.apache.kafka.clients.consumer.SerializeCompatibilityOffsetAndMetadataTest > testOffsetMetadataSerializationCompatibility
STARTED

org.apache.kafka.clients.consumer.SerializeCompatibilityOffsetAndMetadataTest > testOffsetMetadataSerializationCompatibility
PASSED

org.apache.kafka.clients.consumer.ConsumerRecordsTest > iterator STARTED

org.apache.kafka.clients.consumer.ConsumerRecordsTest > iterator PASSED

org.apache.kafka.clients.ClientUtilsTest > testOnlyBadHostname STARTED

org.apache.kafka.clients.ClientUtilsTest > testOnlyBadHostname PASSED

org.apache.kafka.clients.ClientUtilsTest > testParseAndValidateAddresses STARTED

org.apache.kafka.clients.ClientUtilsTest > testParseAndValidateAddresses PASSED

org.apache.kafka.clients.ClientUtilsTest > testNoPort STARTED

org.apache.kafka.clients.ClientUtilsTest > testNoPort PASSED
:examples:checkstyleMain
:examples:compileTestJava UP-TO-DATE
:examples:processTestResources UP-TO-DATE
:examples:testClasses UP-TO-DATE
:examples:checkstyleTest UP-TO-DATE
:examples:test UP-TO-DATE
:log4j-appender:checkstyleMain
:log4j-appender:compileTestJava
:log4j-appender:processTestResources UP-TO-DATE
:log4j-appender:testClasses
:log4j-appender:checkstyleTest
:log4j-appender:test

org.apache.kafka.log4jappender.KafkaLog4jAppenderTest > testLog4jAppends STARTED

org.apache.kafka.log4jappender.KafkaLog4jAppenderTest > testLog4jAppends PASSED

org.apache.kafka.log4jappender.KafkaLog4jAppenderTest > testKafkaLog4jConfigs STARTED

org.apache.kafka.log4jappender.KafkaLog4jAppenderTest > testKafkaLog4jConfigs PASSED
:streams:checkstyleMain
:streams:compileTestJavaNote: Some input files use unchecked or unsafe operations.
Note: Recompile with -Xlint:unchecked for details.

:streams:processTestResources
:streams:testClasses
:streams:checkstyleTest
:streams:test

org.apache.kafka.streams.integration.InternalTopicIntegrationTest > shouldCompactTopicsForStateChangelogs
STARTED

org.apache.kafka.streams.integration.InternalTopicIntegrationTest > shouldCompactTopicsForStateChangelogs
PASSED

org.apache.kafka.streams.integration.KStreamRepartitionJoinTest > shouldCorrectlyRepartitionOnJoinOperations
STARTED

org.apache.kafka.streams.integration.KStreamRepartitionJoinTest > shouldCorrectlyRepartitionOnJoinOperations
PASSED

org.apache.kafka.streams.integration.QueryableStateIntegrationTest > shouldBeAbleToQueryState
STARTED

org.apache.kafka.streams.integration.QueryableStateIntegrationTest > shouldBeAbleToQueryState
PASSED

org.apache.kafka.streams.integration.KStreamAggregationIntegrationTest > shouldReduce STARTED

org.apache.kafka.streams.integration.KStreamAggregationIntegrationTest > shouldReduce PASSED

org.apache.kafka.streams.integration.KStreamAggregationIntegrationTest > shouldAggregate
STARTED

org.apache.kafka.streams.integration.KStreamAggregationIntegrationTest > shouldAggregate
PASSED

org.apache.kafka.streams.integration.KStreamAggregationIntegrationTest > shouldCount STARTED

org.apache.kafka.streams.integration.KStreamAggregationIntegrationTest > shouldCount PASSED

org.apache.kafka.streams.integration.KStreamAggregationIntegrationTest > shouldGroupByKey
STARTED

org.apache.kafka.streams.integration.KStreamAggregationIntegrationTest > shouldGroupByKey
PASSED

org.apache.kafka.streams.integration.KStreamAggregationIntegrationTest > shouldReduceWindowed
STARTED

org.apache.kafka.streams.integration.KStreamAggregationIntegrationTest > shouldReduceWindowed
PASSED

org.apache.kafka.streams.integration.KStreamAggregationIntegrationTest > shouldAggregateWindowed
STARTED

org.apache.kafka.streams.integration.KStreamAggregationIntegrationTest > shouldAggregateWindowed
PASSED

org.apache.kafka.streams.integration.FanoutIntegrationTest > shouldFanoutTheInput STARTED
ERROR: Could not install GRADLE_2_4_RC_2_HOME
java.lang.NullPointerException
	at hudson.plugins.toolenv.ToolEnvBuildWrapper$1.buildEnvVars(ToolEnvBuildWrapper.java:46)
	at hudson.model.AbstractBuild.getEnvironment(AbstractBuild.java:947)
	at hudson.plugins.git.GitSCM.getParamExpandedRepos(GitSCM.java:390)
	at hudson.plugins.git.GitSCM.compareRemoteRevisionWithImpl(GitSCM.java:577)
	at hudson.plugins.git.GitSCM.compareRemoteRevisionWith(GitSCM.java:527)
	at hudson.scm.SCM.compareRemoteRevisionWith(SCM.java:381)
	at hudson.scm.SCM.poll(SCM.java:398)
	at hudson.model.AbstractProject._poll(AbstractProject.java:1453)
	at hudson.model.AbstractProject.poll(AbstractProject.java:1356)
	at hudson.triggers.SCMTrigger$Runner.runPolling(SCMTrigger.java:526)
	at hudson.triggers.SCMTrigger$Runner.run(SCMTrigger.java:555)
	at hudson.util.SequentialExecutionQueue$QueueEntry.run(SequentialExecutionQueue.java:119)
	at java.util.concurrent.Executors$RunnableAdapter.call(Executors.java:471)
	at java.util.concurrent.FutureTask.run(FutureTask.java:262)
	at java.util.concurrent.ThreadPoolExecutor.runWorker(ThreadPoolExecutor.java:1145)
	at java.util.concurrent.ThreadPoolExecutor$Worker.run(ThreadPoolExecutor.java:615)
	at java.lang.Thread.run(Thread.java:745)
ERROR: Could not install JDK_1_7U51_HOME
java.lang.NullPointerException
	at hudson.plugins.toolenv.ToolEnvBuildWrapper$1.buildEnvVars(ToolEnvBuildWrapper.java:46)
	at hudson.model.AbstractBuild.getEnvironment(AbstractBuild.java:947)
	at hudson.plugins.git.GitSCM.getParamExpandedRepos(GitSCM.java:390)
	at hudson.plugins.git.GitSCM.compareRemoteRevisionWithImpl(GitSCM.java:577)
	at hudson.plugins.git.GitSCM.compareRemoteRevisionWith(GitSCM.java:527)
	at hudson.scm.SCM.compareRemoteRevisionWith(SCM.java:381)
	at hudson.scm.SCM.poll(SCM.java:398)
	at hudson.model.AbstractProject._poll(AbstractProject.java:1453)
	at hudson.model.AbstractProject.poll(AbstractProject.java:1356)
	at hudson.triggers.SCMTrigger$Runner.runPolling(SCMTrigger.java:526)
	at hudson.triggers.SCMTrigger$Runner.run(SCMTrigger.java:555)
	at hudson.util.SequentialExecutionQueue$QueueEntry.run(SequentialExecutionQueue.java:119)
	at java.util.concurrent.Executors$RunnableAdapter.call(Executors.java:471)
	at java.util.concurrent.FutureTask.run(FutureTask.java:262)
	at java.util.concurrent.ThreadPoolExecutor.runWorker(ThreadPoolExecutor.java:1145)
	at java.util.concurrent.ThreadPoolExecutor$Worker.run(ThreadPoolExecutor.java:615)
	at java.lang.Thread.run(Thread.java:745)

org.apache.kafka.streams.integration.FanoutIntegrationTest > shouldFanoutTheInput PASSED

org.apache.kafka.streams.integration.RegexSourceIntegrationTest > testShouldReadFromRegexAndNamedTopics
STARTED

org.apache.kafka.streams.integration.RegexSourceIntegrationTest > testShouldReadFromRegexAndNamedTopics
PASSED

org.apache.kafka.streams.integration.RegexSourceIntegrationTest > testRegexMatchesTopicsAWhenCreated
STARTED

org.apache.kafka.streams.integration.RegexSourceIntegrationTest > testRegexMatchesTopicsAWhenCreated
PASSED

org.apache.kafka.streams.integration.RegexSourceIntegrationTest > testRegexMatchesTopicsAWhenDeleted
STARTED

org.apache.kafka.streams.integration.RegexSourceIntegrationTest > testRegexMatchesTopicsAWhenDeleted
PASSED

org.apache.kafka.streams.integration.RegexSourceIntegrationTest > testNoMessagesSentExceptionFromOverlappingPatterns
STARTED

org.apache.kafka.streams.integration.RegexSourceIntegrationTest > testNoMessagesSentExceptionFromOverlappingPatterns
PASSED

org.apache.kafka.streams.integration.KStreamKTableJoinIntegrationTest > shouldCountClicksPerRegion
STARTED
Build timed out (after 120 minutes). Marking the build as failed.
Build was aborted
Recording test results
Setting GRADLE_2_4_RC_2_HOME=/home/jenkins/jenkins-slave/tools/hudson.plugins.gradle.GradleInstallation/Gradle_2.4-rc-2
Setting JDK_1_7U51_HOME=/home/jenkins/jenkins-slave/tools/hudson.model.JDK/jdk-1.7u51
:streams:test FAILED

FAILURE: Build failed with an exception.

* What went wrong:
Execution failed for task ':streams:test'.
> Process 'Gradle Test Executor 4' finished with non-zero exit value 143

* Try:
Run with --stacktrace option to get the stack trace. Run with --info or --debug option to
get more log output.

BUILD FAILED

Total time: 1 hrs 59 mins 28.384 secs
Setting GRADLE_2_4_RC_2_HOME=/home/jenkins/jenkins-slave/tools/hudson.plugins.gradle.GradleInstallation/Gradle_2.4-rc-2
Setting JDK_1_7U51_HOME=/home/jenkins/jenkins-slave/tools/hudson.model.JDK/jdk-1.7u51

Mime
View raw message