kafka-dev mailing list archives

Site index · List index
Message view « Date » · « Thread »
Top « Date » · « Thread »
From "Ismael Juma (JIRA)" <j...@apache.org>
Subject [jira] [Created] (KAFKA-3877) Gradle compiler daemon exits with non-zero exit code while running LogOffsetTest
Date Mon, 20 Jun 2016 13:07:05 GMT
Ismael Juma created KAFKA-3877:
----------------------------------

             Summary: Gradle compiler daemon exits with non-zero exit code while running LogOffsetTest
                 Key: KAFKA-3877
                 URL: https://issues.apache.org/jira/browse/KAFKA-3877
             Project: Kafka
          Issue Type: Sub-task
            Reporter: Ismael Juma


This happened in a recent build:

{code}
kafka.server.LogOffsetTest > testGetOffsetsBeforeNow STARTED
:kafka-trunk-jdk8:core:test FAILED
:test_core_2_11 FAILED

FAILURE: Build failed with an exception.

* What went wrong:
Execution failed for task ':test_core_2_11'.
> Process 'Gradle Compiler Daemon 1' finished with non-zero exit value 137
{code}

https://builds.apache.org/job/kafka-trunk-jdk8/702



--
This message was sent by Atlassian JIRA
(v6.3.4#6332)

Mime
View raw message