kafka-dev mailing list archives

Site index · List index
Message view « Date » · « Thread »
Top « Date » · « Thread »
From Apache Jenkins Server <jenk...@builds.apache.org>
Subject Build failed in Jenkins: kafka-trunk-jdk7 #1379
Date Mon, 20 Jun 2016 21:01:26 GMT
See <https://builds.apache.org/job/kafka-trunk-jdk7/1379/changes>

Changes:

[me] KAFKA-3864: make field.get return field's default value when needed

------------------------------------------
[...truncated 13714 lines...]
org.apache.kafka.streams.processor.internals.PartitionGroupTest > testTimeTracking PASSED

org.apache.kafka.streams.processor.internals.assignment.AssginmentInfoTest > testEncodeDecode
STARTED

org.apache.kafka.streams.processor.internals.assignment.AssginmentInfoTest > testEncodeDecode
PASSED

org.apache.kafka.streams.processor.internals.assignment.SubscriptionInfoTest > testEncodeDecode
STARTED

org.apache.kafka.streams.processor.internals.assignment.SubscriptionInfoTest > testEncodeDecode
PASSED

org.apache.kafka.streams.processor.internals.assignment.TaskAssignorTest > testStickiness
STARTED

org.apache.kafka.streams.processor.internals.assignment.TaskAssignorTest > testStickiness
PASSED

org.apache.kafka.streams.processor.internals.assignment.TaskAssignorTest > testAssignWithStandby
STARTED

org.apache.kafka.streams.processor.internals.assignment.TaskAssignorTest > testAssignWithStandby
PASSED

org.apache.kafka.streams.processor.internals.assignment.TaskAssignorTest > testAssignWithoutStandby
STARTED

org.apache.kafka.streams.processor.internals.assignment.TaskAssignorTest > testAssignWithoutStandby
PASSED

org.apache.kafka.streams.processor.internals.PunctuationQueueTest > testPunctuationInterval
STARTED

org.apache.kafka.streams.processor.internals.PunctuationQueueTest > testPunctuationInterval
PASSED

org.apache.kafka.streams.processor.internals.QuickUnionTest > testUnite STARTED

org.apache.kafka.streams.processor.internals.QuickUnionTest > testUnite PASSED

org.apache.kafka.streams.processor.internals.QuickUnionTest > testUniteMany STARTED

org.apache.kafka.streams.processor.internals.QuickUnionTest > testUniteMany PASSED

org.apache.kafka.streams.processor.internals.ProcessorStateManagerTest > testRegisterNonPersistentStore
STARTED

org.apache.kafka.streams.processor.internals.ProcessorStateManagerTest > testRegisterNonPersistentStore
PASSED

org.apache.kafka.streams.processor.internals.ProcessorStateManagerTest > testLockStateDirectory
STARTED

org.apache.kafka.streams.processor.internals.ProcessorStateManagerTest > testLockStateDirectory
PASSED

org.apache.kafka.streams.processor.internals.ProcessorStateManagerTest > testGetStore STARTED

org.apache.kafka.streams.processor.internals.ProcessorStateManagerTest > testGetStore PASSED

org.apache.kafka.streams.processor.internals.ProcessorStateManagerTest > testClose STARTED

org.apache.kafka.streams.processor.internals.ProcessorStateManagerTest > testClose PASSED

org.apache.kafka.streams.processor.internals.ProcessorStateManagerTest > testChangeLogOffsets
STARTED

org.apache.kafka.streams.processor.internals.ProcessorStateManagerTest > testChangeLogOffsets
PASSED

org.apache.kafka.streams.processor.internals.ProcessorStateManagerTest > testRegisterPersistentStore
STARTED

org.apache.kafka.streams.processor.internals.ProcessorStateManagerTest > testRegisterPersistentStore
PASSED

org.apache.kafka.streams.processor.internals.ProcessorStateManagerTest > testNoTopic STARTED

org.apache.kafka.streams.processor.internals.ProcessorStateManagerTest > testNoTopic PASSED

org.apache.kafka.streams.processor.internals.RecordQueueTest > testTimeTracking STARTED

org.apache.kafka.streams.processor.internals.RecordQueueTest > testTimeTracking PASSED

org.apache.kafka.streams.processor.internals.StreamTaskTest > testProcessOrder STARTED

org.apache.kafka.streams.processor.internals.StreamTaskTest > testProcessOrder PASSED

org.apache.kafka.streams.processor.internals.StreamTaskTest > testPauseResume STARTED

org.apache.kafka.streams.processor.internals.StreamTaskTest > testPauseResume PASSED

org.apache.kafka.streams.processor.internals.StreamTaskTest > testMaybePunctuate STARTED

org.apache.kafka.streams.processor.internals.StreamTaskTest > testMaybePunctuate PASSED

org.apache.kafka.streams.processor.internals.StreamThreadTest > testInjectClients STARTED

org.apache.kafka.streams.processor.internals.StreamThreadTest > testInjectClients PASSED

org.apache.kafka.streams.processor.internals.StreamThreadTest > testMaybeCommit STARTED

org.apache.kafka.streams.processor.internals.StreamThreadTest > testMaybeCommit PASSED

org.apache.kafka.streams.processor.internals.StreamThreadTest > testPartitionAssignmentChange
STARTED

org.apache.kafka.streams.processor.internals.StreamThreadTest > testPartitionAssignmentChange
PASSED

org.apache.kafka.streams.processor.internals.StreamThreadTest > testMaybeClean STARTED

org.apache.kafka.streams.processor.internals.StreamThreadTest > testMaybeClean PASSED

org.apache.kafka.streams.processor.internals.MinTimestampTrackerTest > testTracking STARTED

org.apache.kafka.streams.processor.internals.MinTimestampTrackerTest > testTracking PASSED

org.apache.kafka.streams.processor.internals.StreamPartitionAssignorTest > testAssignWithStandbyReplicas
STARTED

org.apache.kafka.streams.processor.internals.StreamPartitionAssignorTest > testAssignWithStandbyReplicas
PASSED

org.apache.kafka.streams.processor.internals.StreamPartitionAssignorTest > testAssignWithNewTasks
STARTED

org.apache.kafka.streams.processor.internals.StreamPartitionAssignorTest > testAssignWithNewTasks
PASSED

org.apache.kafka.streams.processor.internals.StreamPartitionAssignorTest > testAssignWithStates
STARTED

org.apache.kafka.streams.processor.internals.StreamPartitionAssignorTest > testAssignWithStates
PASSED

org.apache.kafka.streams.processor.internals.StreamPartitionAssignorTest > testAssignBasic
STARTED

org.apache.kafka.streams.processor.internals.StreamPartitionAssignorTest > testAssignBasic
PASSED

org.apache.kafka.streams.processor.internals.StreamPartitionAssignorTest > testOnAssignment
STARTED

org.apache.kafka.streams.processor.internals.StreamPartitionAssignorTest > testOnAssignment
PASSED

org.apache.kafka.streams.processor.internals.StreamPartitionAssignorTest > testAssignWithInternalTopicThatsSourceIsAnotherInternalTopic
STARTED

org.apache.kafka.streams.processor.internals.StreamPartitionAssignorTest > testAssignWithInternalTopicThatsSourceIsAnotherInternalTopic
PASSED

org.apache.kafka.streams.processor.internals.StreamPartitionAssignorTest > testSubscription
STARTED

org.apache.kafka.streams.processor.internals.StreamPartitionAssignorTest > testSubscription
PASSED

org.apache.kafka.streams.processor.internals.StreamPartitionAssignorTest > testAssignWithInternalTopics
STARTED

org.apache.kafka.streams.processor.internals.StreamPartitionAssignorTest > testAssignWithInternalTopics
PASSED

org.apache.kafka.streams.processor.TopologyBuilderTest > testSourceTopics STARTED

org.apache.kafka.streams.processor.TopologyBuilderTest > testSourceTopics PASSED

org.apache.kafka.streams.processor.TopologyBuilderTest > testNamedTopicMatchesAlreadyProvidedPattern
STARTED

org.apache.kafka.streams.processor.TopologyBuilderTest > testNamedTopicMatchesAlreadyProvidedPattern
PASSED

org.apache.kafka.streams.processor.TopologyBuilderTest > testAddSinkWithSameName STARTED

org.apache.kafka.streams.processor.TopologyBuilderTest > testAddSinkWithSameName PASSED

org.apache.kafka.streams.processor.TopologyBuilderTest > testAddSinkWithSelfParent STARTED

org.apache.kafka.streams.processor.TopologyBuilderTest > testAddSinkWithSelfParent PASSED

org.apache.kafka.streams.processor.TopologyBuilderTest > testAddProcessorWithSelfParent
STARTED

org.apache.kafka.streams.processor.TopologyBuilderTest > testAddProcessorWithSelfParent
PASSED

org.apache.kafka.streams.processor.TopologyBuilderTest > testAddStateStoreWithSink STARTED

org.apache.kafka.streams.processor.TopologyBuilderTest > testAddStateStoreWithSink PASSED

org.apache.kafka.streams.processor.TopologyBuilderTest > testTopicGroups STARTED

org.apache.kafka.streams.processor.TopologyBuilderTest > testTopicGroups PASSED

org.apache.kafka.streams.processor.TopologyBuilderTest > testBuild STARTED

org.apache.kafka.streams.processor.TopologyBuilderTest > testBuild PASSED

org.apache.kafka.streams.processor.TopologyBuilderTest > testAddStateStoreWithSource STARTED

org.apache.kafka.streams.processor.TopologyBuilderTest > testAddStateStoreWithSource PASSED

org.apache.kafka.streams.processor.TopologyBuilderTest > testAddSourceWithSameName STARTED

org.apache.kafka.streams.processor.TopologyBuilderTest > testAddSourceWithSameName PASSED

org.apache.kafka.streams.processor.TopologyBuilderTest > testAddMoreThanOnePatternSourceNode
STARTED

org.apache.kafka.streams.processor.TopologyBuilderTest > testAddMoreThanOnePatternSourceNode
PASSED

org.apache.kafka.streams.processor.TopologyBuilderTest > testAddProcessorWithSameName STARTED

org.apache.kafka.streams.processor.TopologyBuilderTest > testAddProcessorWithSameName PASSED

org.apache.kafka.streams.processor.TopologyBuilderTest > testAddSourceWithSameTopic STARTED

org.apache.kafka.streams.processor.TopologyBuilderTest > testAddSourceWithSameTopic PASSED

org.apache.kafka.streams.processor.TopologyBuilderTest > testTopicGroupsByStateStore STARTED

org.apache.kafka.streams.processor.TopologyBuilderTest > testTopicGroupsByStateStore PASSED

org.apache.kafka.streams.processor.TopologyBuilderTest > testAddStateStoreWithDuplicates
STARTED

org.apache.kafka.streams.processor.TopologyBuilderTest > testAddStateStoreWithDuplicates
PASSED

org.apache.kafka.streams.processor.TopologyBuilderTest > testPatternSourceTopic STARTED

org.apache.kafka.streams.processor.TopologyBuilderTest > testPatternSourceTopic PASSED

org.apache.kafka.streams.processor.TopologyBuilderTest > testAddSinkWithWrongParent STARTED

org.apache.kafka.streams.processor.TopologyBuilderTest > testAddSinkWithWrongParent PASSED

org.apache.kafka.streams.processor.TopologyBuilderTest > testPatternMatchesAlreadyProvidedTopicSource
STARTED

org.apache.kafka.streams.processor.TopologyBuilderTest > testPatternMatchesAlreadyProvidedTopicSource
PASSED

org.apache.kafka.streams.processor.TopologyBuilderTest > testAddSinkConnectedWithMultipleParent
STARTED

org.apache.kafka.streams.processor.TopologyBuilderTest > testAddSinkConnectedWithMultipleParent
PASSED

org.apache.kafka.streams.processor.TopologyBuilderTest > testSubscribeTopicNameAndPattern
STARTED

org.apache.kafka.streams.processor.TopologyBuilderTest > testSubscribeTopicNameAndPattern
PASSED

org.apache.kafka.streams.processor.TopologyBuilderTest > testAddProcessorWithWrongParent
STARTED

org.apache.kafka.streams.processor.TopologyBuilderTest > testAddProcessorWithWrongParent
PASSED

org.apache.kafka.streams.processor.TopologyBuilderTest > testAddStateStore STARTED

org.apache.kafka.streams.processor.TopologyBuilderTest > testAddStateStore PASSED

org.apache.kafka.streams.processor.TopologyBuilderTest > testAddSinkConnectedWithParent
STARTED

org.apache.kafka.streams.processor.TopologyBuilderTest > testAddSinkConnectedWithParent
PASSED

org.apache.kafka.streams.processor.TopologyBuilderTest > testAddStateStoreWithNonExistingProcessor
STARTED

org.apache.kafka.streams.processor.TopologyBuilderTest > testAddStateStoreWithNonExistingProcessor
PASSED
pure virtual method called
terminate called without an active exception

216 tests completed, 2 failed
:streams:test FAILED

FAILURE: Build failed with an exception.

* What went wrong:
Execution failed for task ':streams:test'.
> Process 'Gradle Test Executor 4' finished with non-zero exit value 134

* Try:
Run with --stacktrace option to get the stack trace. Run with --info or --debug option to
get more log output.

BUILD FAILED

Total time: 1 hrs 5 mins 24.7 secs
Build step 'Execute shell' marked build as failure
Recording test results
Setting GRADLE_2_4_RC_2_HOME=/home/jenkins/jenkins-slave/tools/hudson.plugins.gradle.GradleInstallation/Gradle_2.4-rc-2
Setting JDK_1_7U51_HOME=/home/jenkins/jenkins-slave/tools/hudson.model.JDK/jdk-1.7u51
Setting GRADLE_2_4_RC_2_HOME=/home/jenkins/jenkins-slave/tools/hudson.plugins.gradle.GradleInstallation/Gradle_2.4-rc-2
Setting JDK_1_7U51_HOME=/home/jenkins/jenkins-slave/tools/hudson.model.JDK/jdk-1.7u51

Mime
View raw message