kafka-dev mailing list archives

Site index · List index
Message view « Date » · « Thread »
Top « Date » · « Thread »
From Apache Jenkins Server <jenk...@builds.apache.org>
Subject Build failed in Jenkins: kafka-0.10.0-jdk7 #122
Date Tue, 07 Jun 2016 06:10:04 GMT
See <https://builds.apache.org/job/kafka-0.10.0-jdk7/122/changes>

Changes:

[me] KAFKA-3781; Errors.exceptionName() can throw NPE

------------------------------------------
[...truncated 5628 lines...]
org.apache.kafka.streams.kstream.internals.KTableForeachTest > testForeach PASSED

org.apache.kafka.streams.kstream.internals.KStreamTransformValuesTest > testTransform PASSED

org.apache.kafka.streams.kstream.internals.KStreamBranchTest > testKStreamBranch PASSED

org.apache.kafka.streams.kstream.internals.KTableMapValuesTest > testSendingOldValue PASSED

org.apache.kafka.streams.kstream.internals.KTableMapValuesTest > testNotSendingOldValue
PASSED

org.apache.kafka.streams.kstream.internals.KTableMapValuesTest > testKTable PASSED

org.apache.kafka.streams.kstream.internals.KTableMapValuesTest > testValueGetter PASSED

org.apache.kafka.streams.kstream.internals.KStreamKTableLeftJoinTest > testNotJoinable
PASSED

org.apache.kafka.streams.kstream.internals.KStreamKTableLeftJoinTest > testJoin PASSED

org.apache.kafka.streams.kstream.internals.KeyValuePrinterProcessorTest > testPrintKeyValueWithProvidedSerde
PASSED

org.apache.kafka.streams.kstream.internals.KeyValuePrinterProcessorTest > testPrintKeyValueDefaultSerde
PASSED

org.apache.kafka.streams.kstream.internals.KTableKTableJoinTest > testJoin PASSED

org.apache.kafka.streams.kstream.internals.KTableKTableJoinTest > testNotSendingOldValues
PASSED

org.apache.kafka.streams.kstream.internals.KTableKTableJoinTest > testSendingOldValues
PASSED

org.apache.kafka.streams.kstream.internals.KGroupedTableImplTest > testGroupedCountOccurences
PASSED

org.apache.kafka.streams.kstream.internals.KStreamFilterTest > testFilterNot PASSED

org.apache.kafka.streams.kstream.internals.KStreamFilterTest > testFilter PASSED

org.apache.kafka.streams.kstream.internals.KTableImplTest > testStateStore PASSED

org.apache.kafka.streams.kstream.internals.KTableImplTest > testRepartition PASSED

org.apache.kafka.streams.kstream.internals.KTableImplTest > testStateStoreLazyEval PASSED

org.apache.kafka.streams.kstream.internals.KTableImplTest > testKTable PASSED

org.apache.kafka.streams.kstream.internals.KTableImplTest > testValueGetter PASSED

org.apache.kafka.streams.kstream.internals.KStreamSelectKeyTest > testSelectKey PASSED

org.apache.kafka.streams.kstream.internals.KTableSourceTest > testNotSedingOldValue PASSED

org.apache.kafka.streams.kstream.internals.KTableSourceTest > testSedingOldValue PASSED

org.apache.kafka.streams.kstream.internals.KTableSourceTest > testKTable PASSED

org.apache.kafka.streams.kstream.internals.KTableSourceTest > testValueGetter PASSED

org.apache.kafka.streams.kstream.internals.KStreamKStreamJoinTest > testOuterJoin PASSED

org.apache.kafka.streams.kstream.internals.KStreamKStreamJoinTest > testJoin PASSED

org.apache.kafka.streams.kstream.internals.KStreamKStreamJoinTest > testWindowing PASSED

org.apache.kafka.streams.kstream.internals.KStreamFlatMapValuesTest > testFlatMapValues
PASSED

org.apache.kafka.streams.kstream.internals.KStreamImplTest > testToWithNullValueSerdeDoesntNPE
PASSED

org.apache.kafka.streams.kstream.internals.KStreamImplTest > testNumProcesses PASSED

org.apache.kafka.streams.kstream.internals.KTableFilterTest > testSendingOldValue PASSED

org.apache.kafka.streams.kstream.internals.KTableFilterTest > testNotSendingOldValue PASSED

org.apache.kafka.streams.kstream.internals.KTableFilterTest > testKTable PASSED

org.apache.kafka.streams.kstream.internals.KTableFilterTest > testValueGetter PASSED

org.apache.kafka.streams.kstream.internals.KStreamForeachTest > testForeach PASSED

org.apache.kafka.streams.kstream.internals.KTableMapKeysTest > testMapKeysConvertingToStream
PASSED

org.apache.kafka.streams.kstream.internals.KTableAggregateTest > testAggBasic PASSED

org.apache.kafka.streams.kstream.internals.KStreamFlatMapTest > testFlatMap PASSED

org.apache.kafka.streams.kstream.internals.KTableKTableLeftJoinTest > testSendingOldValue
PASSED

org.apache.kafka.streams.kstream.internals.KTableKTableLeftJoinTest > testJoin PASSED

org.apache.kafka.streams.kstream.internals.KTableKTableLeftJoinTest > testNotSendingOldValue
PASSED

org.apache.kafka.streams.kstream.internals.WindowedStreamPartitionerTest > testCopartitioning
PASSED

org.apache.kafka.streams.StreamsConfigTest > testGetConsumerConfigs PASSED

org.apache.kafka.streams.StreamsConfigTest > defaultSerdeShouldBeConfigured PASSED

org.apache.kafka.streams.StreamsConfigTest > testGetProducerConfigs PASSED

org.apache.kafka.streams.StreamsConfigTest > shouldSupportMultipleBootstrapServers PASSED

org.apache.kafka.streams.StreamsConfigTest > testGetRestoreConsumerConfigs PASSED

org.apache.kafka.streams.processor.DefaultPartitionGrouperTest > testGrouping PASSED

org.apache.kafka.streams.processor.internals.StreamThreadTest > testInjectClients PASSED

org.apache.kafka.streams.processor.internals.StreamThreadTest > testMaybeCommit PASSED

org.apache.kafka.streams.processor.internals.StreamThreadTest > testPartitionAssignmentChange
PASSED

org.apache.kafka.streams.processor.internals.StreamThreadTest > testMaybeClean PASSED

org.apache.kafka.streams.processor.internals.QuickUnionTest > testUnite PASSED

org.apache.kafka.streams.processor.internals.QuickUnionTest > testUniteMany PASSED

org.apache.kafka.streams.processor.internals.MinTimestampTrackerTest > testTracking PASSED

org.apache.kafka.streams.processor.internals.ProcessorStateManagerTest > testRegisterNonPersistentStore
PASSED

org.apache.kafka.streams.processor.internals.ProcessorStateManagerTest > testLockStateDirectory
PASSED

org.apache.kafka.streams.processor.internals.ProcessorStateManagerTest > testGetStore PASSED

org.apache.kafka.streams.processor.internals.ProcessorStateManagerTest > testClose PASSED

org.apache.kafka.streams.processor.internals.ProcessorStateManagerTest > testChangeLogOffsets
PASSED

org.apache.kafka.streams.processor.internals.ProcessorStateManagerTest > testRegisterPersistentStore
PASSED

org.apache.kafka.streams.processor.internals.ProcessorStateManagerTest > testNoTopic PASSED

org.apache.kafka.streams.processor.internals.assignment.TaskAssignorTest > testStickiness
PASSED

org.apache.kafka.streams.processor.internals.assignment.TaskAssignorTest > testAssignWithStandby
PASSED

org.apache.kafka.streams.processor.internals.assignment.TaskAssignorTest > testAssignWithoutStandby
PASSED

org.apache.kafka.streams.processor.internals.assignment.SubscriptionInfoTest > testEncodeDecode
PASSED

org.apache.kafka.streams.processor.internals.assignment.AssginmentInfoTest > testEncodeDecode
PASSED

org.apache.kafka.streams.processor.internals.PunctuationQueueTest > testPunctuationInterval
PASSED

org.apache.kafka.streams.processor.internals.StreamTaskTest > testProcessOrder PASSED

org.apache.kafka.streams.processor.internals.StreamTaskTest > testPauseResume PASSED

org.apache.kafka.streams.processor.internals.StreamTaskTest > testMaybePunctuate PASSED

org.apache.kafka.streams.processor.internals.ProcessorTopologyTest > testDrivingMultiplexingTopology
PASSED

org.apache.kafka.streams.processor.internals.ProcessorTopologyTest > testDrivingStatefulTopology
PASSED

org.apache.kafka.streams.processor.internals.ProcessorTopologyTest > testDrivingSimpleTopology
PASSED

org.apache.kafka.streams.processor.internals.ProcessorTopologyTest > testTopologyMetadata
PASSED

org.apache.kafka.streams.processor.internals.ProcessorTopologyTest > testDrivingMultiplexByNameTopology
PASSED

org.apache.kafka.streams.processor.internals.StandbyTaskTest > testStorePartitions PASSED

org.apache.kafka.streams.processor.internals.StandbyTaskTest > testUpdateKTable PASSED

org.apache.kafka.streams.processor.internals.StandbyTaskTest > testUpdateNonPersistentStore
PASSED

org.apache.kafka.streams.processor.internals.StandbyTaskTest > testUpdate PASSED

org.apache.kafka.streams.processor.internals.RecordQueueTest > testTimeTracking PASSED

org.apache.kafka.streams.processor.internals.PartitionGroupTest > testTimeTracking PASSED

org.apache.kafka.streams.processor.internals.StreamPartitionAssignorTest > testAssignWithStandbyReplicas
PASSED

org.apache.kafka.streams.processor.internals.StreamPartitionAssignorTest > testAssignWithNewTasks
PASSED

org.apache.kafka.streams.processor.internals.StreamPartitionAssignorTest > testAssignWithStates
PASSED

org.apache.kafka.streams.processor.internals.StreamPartitionAssignorTest > testAssignBasic
PASSED

org.apache.kafka.streams.processor.internals.StreamPartitionAssignorTest > testOnAssignment
PASSED

org.apache.kafka.streams.processor.internals.StreamPartitionAssignorTest > testSubscription
PASSED

org.apache.kafka.streams.processor.internals.StreamPartitionAssignorTest > testAssignWithInternalTopics
PASSED

org.apache.kafka.streams.processor.internals.RecordCollectorTest > testSpecificPartition
PASSED

org.apache.kafka.streams.processor.internals.RecordCollectorTest > testStreamPartitioner
PASSED

org.apache.kafka.streams.processor.TopologyBuilderTest > testSourceTopics PASSED

org.apache.kafka.streams.processor.TopologyBuilderTest > testAddSinkWithSameName PASSED

org.apache.kafka.streams.processor.TopologyBuilderTest > testAddSinkWithSelfParent PASSED

org.apache.kafka.streams.processor.TopologyBuilderTest > testAddProcessorWithSelfParent
PASSED

org.apache.kafka.streams.processor.TopologyBuilderTest > testAddStateStoreWithSink PASSED

org.apache.kafka.streams.processor.TopologyBuilderTest > testTopicGroups PASSED

org.apache.kafka.streams.processor.TopologyBuilderTest > testBuild PASSED

org.apache.kafka.streams.processor.TopologyBuilderTest > testAddStateStoreWithSource PASSED

org.apache.kafka.streams.processor.TopologyBuilderTest > testAddSourceWithSameName PASSED

org.apache.kafka.streams.processor.TopologyBuilderTest > testAddProcessorWithSameName PASSED

org.apache.kafka.streams.processor.TopologyBuilderTest > testAddSourceWithSameTopic PASSED

org.apache.kafka.streams.processor.TopologyBuilderTest > testTopicGroupsByStateStore PASSED

org.apache.kafka.streams.processor.TopologyBuilderTest > testAddStateStoreWithDuplicates
PASSED

org.apache.kafka.streams.processor.TopologyBuilderTest > testAddSinkWithWrongParent PASSED

org.apache.kafka.streams.processor.TopologyBuilderTest > testAddSinkConnectedWithMultipleParent
PASSED

org.apache.kafka.streams.processor.TopologyBuilderTest > testAddProcessorWithWrongParent
PASSED

org.apache.kafka.streams.processor.TopologyBuilderTest > testAddStateStore PASSED

org.apache.kafka.streams.processor.TopologyBuilderTest > testAddSinkConnectedWithParent
PASSED

org.apache.kafka.streams.processor.TopologyBuilderTest > testAddStateStoreWithNonExistingProcessor
PASSED

org.apache.kafka.streams.KeyValueTest > shouldHaveSaneEqualsAndHashCode PASSED

181 tests completed, 1 failed
:streams:test FAILED

FAILURE: Build failed with an exception.

* What went wrong:
Execution failed for task ':streams:test'.
> There were failing tests. See the report at: file://<https://builds.apache.org/job/kafka-0.10.0-jdk7/ws/streams/build/reports/tests/index.html>

* Try:
Run with --stacktrace option to get the stack trace. Run with --info or --debug option to
get more log output.

BUILD FAILED

Total time: 1 hrs 50 mins 13.751 secs
Build step 'Execute shell' marked build as failure
Recording test results
Setting GRADLE_2_4_RC_2_HOME=/home/jenkins/jenkins-slave/tools/hudson.plugins.gradle.GradleInstallation/Gradle_2.4-rc-2
Setting JDK_1_7U51_HOME=/home/jenkins/jenkins-slave/tools/hudson.model.JDK/jdk-1.7u51
Setting GRADLE_2_4_RC_2_HOME=/home/jenkins/jenkins-slave/tools/hudson.plugins.gradle.GradleInstallation/Gradle_2.4-rc-2
Setting JDK_1_7U51_HOME=/home/jenkins/jenkins-slave/tools/hudson.model.JDK/jdk-1.7u51

Mime
View raw message