kafka-dev mailing list archives

Site index · List index
Message view « Date » · « Thread »
Top « Date » · « Thread »
From Apache Jenkins Server <jenk...@builds.apache.org>
Subject Build failed in Jenkins: kafka-trunk-jdk8 #668
Date Thu, 02 Jun 2016 05:12:57 GMT
See <https://builds.apache.org/job/kafka-trunk-jdk8/668/changes>

Changes:

[me] MINOR: Add a newline to a Javadoc sample in KafkaConsumer

------------------------------------------
Started by an SCM change
[EnvInject] - Loading node environment variables.
Building remotely on ubuntu-us1 (Ubuntu ubuntu ubuntu-us golang-ppa) in workspace <https://builds.apache.org/job/kafka-trunk-jdk8/ws/>
 > git rev-parse --is-inside-work-tree # timeout=10
Fetching changes from the remote Git repository
 > git config remote.origin.url https://git-wip-us.apache.org/repos/asf/kafka.git # timeout=10
Fetching upstream changes from https://git-wip-us.apache.org/repos/asf/kafka.git
 > git --version # timeout=10
 > git -c core.askpass=true fetch --tags --progress https://git-wip-us.apache.org/repos/asf/kafka.git
+refs/heads/*:refs/remotes/origin/*
 > git rev-parse refs/remotes/origin/trunk^{commit} # timeout=10
 > git rev-parse refs/remotes/origin/origin/trunk^{commit} # timeout=10
Checking out Revision 107205a7f17a4b1e235089668cb283bf16fbb88a (refs/remotes/origin/trunk)
 > git config core.sparsecheckout # timeout=10
 > git checkout -f 107205a7f17a4b1e235089668cb283bf16fbb88a
 > git rev-list ab7325928164b0cc7c26c695ecdf431ce1d89b8d # timeout=10
Setting GRADLE_2_4_RC_2_HOME=/home/jenkins/jenkins-slave/tools/hudson.plugins.gradle.GradleInstallation/Gradle_2.4-rc-2
Setting JDK1_8_0_66_HOME=/home/jenkins/jenkins-slave/tools/hudson.model.JDK/jdk1.8.0_66
[kafka-trunk-jdk8] $ /bin/bash -xe /tmp/hudson4130427658988518148.sh
+ /home/jenkins/jenkins-slave/tools/hudson.plugins.gradle.GradleInstallation/Gradle_2.4-rc-2/bin/gradle
To honour the JVM settings for this build a new JVM will be forked. Please consider using
the daemon: http://gradle.org/docs/2.4-rc-2/userguide/gradle_daemon.html.
Building project 'core' with Scala version 2.10.6
:downloadWrapper

BUILD SUCCESSFUL

Total time: 14.303 secs
Setting GRADLE_2_4_RC_2_HOME=/home/jenkins/jenkins-slave/tools/hudson.plugins.gradle.GradleInstallation/Gradle_2.4-rc-2
Setting JDK1_8_0_66_HOME=/home/jenkins/jenkins-slave/tools/hudson.model.JDK/jdk1.8.0_66
[kafka-trunk-jdk8] $ /bin/bash -xe /tmp/hudson8471493395173628713.sh
+ export GRADLE_OPTS=-Xmx1024m
+ GRADLE_OPTS=-Xmx1024m
+ ./gradlew -Dorg.gradle.project.maxParallelForks=1 clean jarAll testAll
To honour the JVM settings for this build a new JVM will be forked. Please consider using
the daemon: https://docs.gradle.org/2.13/userguide/gradle_daemon.html.
Building project 'core' with Scala version 2.10.6
Build file '<https://builds.apache.org/job/kafka-trunk-jdk8/ws/build.gradle'>: line
231
useAnt has been deprecated and is scheduled to be removed in Gradle 3.0. The Ant-Based Scala
compiler is deprecated, please see https://docs.gradle.org/current/userguide/scala_plugin.html.
:clean UP-TO-DATE
:clients:clean UP-TO-DATE
:connect:clean UP-TO-DATE
:core:clean
:examples:clean UP-TO-DATE
:log4j-appender:clean UP-TO-DATE
:streams:clean UP-TO-DATE
:tools:clean UP-TO-DATE
:connect:api:clean UP-TO-DATE
:connect:file:clean UP-TO-DATE
:connect:json:clean UP-TO-DATE
:connect:runtime:clean UP-TO-DATE
:streams:examples:clean UP-TO-DATE
:jar_core_2_10
Building project 'core' with Scala version 2.10.6
:kafka-trunk-jdk8:clients:compileJava
:jar_core_2_10 FAILED

FAILURE: Build failed with an exception.

* What went wrong:
Failed to capture snapshot of input files for task 'compileJava' during up-to-date check.
> Could not add entry '/home/jenkins/.gradle/caches/modules-2/files-2.1/net.jpountz.lz4/lz4/1.3.0/c708bb2590c0652a642236ef45d9f99ff842a2ce/lz4-1.3.0.jar'
to cache fileHashes.bin (<https://builds.apache.org/job/kafka-trunk-jdk8/ws/.gradle/2.13/taskArtifacts/fileHashes.bin).>

* Try:
Run with --stacktrace option to get the stack trace. Run with --info or --debug option to
get more log output.

BUILD FAILED

Total time: 13.287 secs
Build step 'Execute shell' marked build as failure
Recording test results
Setting GRADLE_2_4_RC_2_HOME=/home/jenkins/jenkins-slave/tools/hudson.plugins.gradle.GradleInstallation/Gradle_2.4-rc-2
Setting JDK1_8_0_66_HOME=/home/jenkins/jenkins-slave/tools/hudson.model.JDK/jdk1.8.0_66
ERROR: Step ‘Publish JUnit test result report’ failed: No test report files were found.
Configuration error?
Setting GRADLE_2_4_RC_2_HOME=/home/jenkins/jenkins-slave/tools/hudson.plugins.gradle.GradleInstallation/Gradle_2.4-rc-2
Setting JDK1_8_0_66_HOME=/home/jenkins/jenkins-slave/tools/hudson.model.JDK/jdk1.8.0_66

Mime
View raw message