kafka-dev mailing list archives

Site index · List index
Message view « Date » · « Thread »
Top « Date » · « Thread »
From "Sasaki Toru (JIRA)" <j...@apache.org>
Subject [jira] [Updated] (KAFKA-3767) Failed Kafka Connect's unit test because of Unknown license.
Date Sat, 28 May 2016 09:04:13 GMT

     [ https://issues.apache.org/jira/browse/KAFKA-3767?page=com.atlassian.jira.plugin.system.issuetabpanels:all-tabpanel
]

Sasaki Toru updated KAFKA-3767:
-------------------------------
    Description: 
Kafka Connect's unit test failed with Unknown license as blow.

{quote}
$ ./gradlew test
(snip)
:rat
Unknown license: /home/kafka/code/kafka/connect/json/src/test/resources/connect-test.properties
:rat FAILED

FAILURE: Build failed with an exception.

* Where:
Script '/home/kafka/code/kafka/gradle/rat.gradle' line: 63

* What went wrong:
Execution failed for task ':rat'.
> Found 1 files with unknown licenses.

* Try:
Run with --stacktrace option to get the stack trace. Run with --info or --debug option to
get more log output.

BUILD FAILED
{quote}

I think this is because connect-test.properties doesn't have license.

  was:
Kafka Connect's unit test failed with Unknown license as blow.

{quote}
$ ./gradlew cleanTest test
(snip)
:rat
Unknown license: /home/kafka/code/kafka/connect/json/src/test/resources/connect-test.properties
:rat FAILED

FAILURE: Build failed with an exception.

* Where:
Script '/home/kafka/code/kafka/gradle/rat.gradle' line: 63

* What went wrong:
Execution failed for task ':rat'.
> Found 1 files with unknown licenses.

* Try:
Run with --stacktrace option to get the stack trace. Run with --info or --debug option to
get more log output.

BUILD FAILED
{quote}

I think this is because connect-test.properties doesn't have license.


> Failed Kafka Connect's unit test because of Unknown license.
> ------------------------------------------------------------
>
>                 Key: KAFKA-3767
>                 URL: https://issues.apache.org/jira/browse/KAFKA-3767
>             Project: Kafka
>          Issue Type: Bug
>          Components: KafkaConnect, unit tests
>            Reporter: Sasaki Toru
>            Assignee: Sasaki Toru
>
> Kafka Connect's unit test failed with Unknown license as blow.
> {quote}
> $ ./gradlew test
> (snip)
> :rat
> Unknown license: /home/kafka/code/kafka/connect/json/src/test/resources/connect-test.properties
> :rat FAILED
> FAILURE: Build failed with an exception.
> * Where:
> Script '/home/kafka/code/kafka/gradle/rat.gradle' line: 63
> * What went wrong:
> Execution failed for task ':rat'.
> > Found 1 files with unknown licenses.
> * Try:
> Run with --stacktrace option to get the stack trace. Run with --info or --debug option
to get more log output.
> BUILD FAILED
> {quote}
> I think this is because connect-test.properties doesn't have license.



--
This message was sent by Atlassian JIRA
(v6.3.4#6332)

Mime
View raw message