kafka-dev mailing list archives

Site index · List index
Message view « Date » · « Thread »
Top « Date » · « Thread »
From Apache Jenkins Server <jenk...@builds.apache.org>
Subject Build failed in Jenkins: kafka-trunk-jdk8 #641
Date Thu, 19 May 2016 18:11:11 GMT
See <https://builds.apache.org/job/kafka-trunk-jdk8/641/changes>

Changes:

[ismael] MINOR: Move `Incorporating Security Features in a Running Cluster` to

[me] KAFKA-2935: Remove vestigial WorkerConfig.CLUSTER_CONFIG

------------------------------------------
[...truncated 1668 lines...]
kafka.log.OffsetIndexTest > lookupExtremeCases PASSED

kafka.log.OffsetIndexTest > appendTooMany PASSED

kafka.log.OffsetIndexTest > randomLookupTest PASSED

kafka.log.OffsetIndexTest > testReopen PASSED

kafka.log.OffsetIndexTest > appendOutOfOrder PASSED

kafka.log.OffsetIndexTest > truncate PASSED

kafka.log.LogSegmentTest > testRecoveryWithCorruptMessage PASSED

kafka.log.LogSegmentTest > testRecoveryFixesCorruptIndex PASSED

kafka.log.LogSegmentTest > testReadFromGap PASSED

kafka.log.LogSegmentTest > testTruncate PASSED

kafka.log.LogSegmentTest > testReadBeforeFirstOffset PASSED

kafka.log.LogSegmentTest > testCreateWithInitFileSizeAppendMessage PASSED

kafka.log.LogSegmentTest > testChangeFileSuffixes PASSED

kafka.log.LogSegmentTest > testMaxOffset PASSED

kafka.log.LogSegmentTest > testNextOffsetCalculation PASSED

kafka.log.LogSegmentTest > testReadOnEmptySegment PASSED

kafka.log.LogSegmentTest > testReadAfterLast PASSED

kafka.log.LogSegmentTest > testCreateWithInitFileSizeClearShutdown PASSED

kafka.log.LogSegmentTest > testTruncateFull PASSED

kafka.log.CleanerTest > testBuildOffsetMap PASSED

kafka.log.CleanerTest > testBuildOffsetMapFakeLarge PASSED

kafka.log.CleanerTest > testSegmentGrouping PASSED

kafka.log.CleanerTest > testCleanSegmentsWithAbort PASSED

kafka.log.CleanerTest > testSegmentGroupingWithSparseOffsets PASSED

kafka.log.CleanerTest > testRecoveryAfterCrash PASSED

kafka.log.CleanerTest > testLogToClean PASSED

kafka.log.CleanerTest > testCleaningWithDeletes PASSED

kafka.log.CleanerTest > testCleanSegments PASSED

kafka.log.CleanerTest > testCleaningWithUnkeyedMessages PASSED

kafka.log.OffsetMapTest > testClear PASSED

kafka.log.OffsetMapTest > testBasicValidation PASSED

kafka.coordinator.GroupCoordinatorResponseTest > testHeartbeatWrongCoordinator PASSED

kafka.coordinator.GroupCoordinatorResponseTest > testDescribeGroupStable PASSED

kafka.coordinator.GroupCoordinatorResponseTest > testHeartbeatIllegalGeneration PASSED

kafka.coordinator.GroupCoordinatorResponseTest > testDescribeGroupWrongCoordinator PASSED

kafka.coordinator.GroupCoordinatorResponseTest > testDescribeGroupRebalancing PASSED

kafka.coordinator.GroupCoordinatorResponseTest > testLeaderFailureInSyncGroup PASSED

kafka.coordinator.GroupCoordinatorResponseTest > testGenerationIdIncrementsOnRebalance
PASSED

kafka.coordinator.GroupCoordinatorResponseTest > testSyncGroupFromIllegalGeneration PASSED

kafka.coordinator.GroupCoordinatorResponseTest > testInvalidGroupId PASSED

kafka.coordinator.GroupCoordinatorResponseTest > testHeartbeatUnknownGroup PASSED

kafka.coordinator.GroupCoordinatorResponseTest > testListGroupsIncludesStableGroups PASSED

kafka.coordinator.GroupCoordinatorResponseTest > testHeartbeatDuringRebalanceCausesRebalanceInProgress
PASSED

kafka.coordinator.GroupCoordinatorResponseTest > testSessionTimeout PASSED

kafka.coordinator.GroupCoordinatorResponseTest > testJoinGroupInconsistentGroupProtocol
PASSED

kafka.coordinator.GroupCoordinatorResponseTest > testJoinGroupSessionTimeoutTooLarge PASSED

kafka.coordinator.GroupCoordinatorResponseTest > testJoinGroupSessionTimeoutTooSmall PASSED

kafka.coordinator.GroupCoordinatorResponseTest > testSyncGroupEmptyAssignment PASSED

kafka.coordinator.GroupCoordinatorResponseTest > testCommitOffsetWithDefaultGeneration
PASSED

kafka.coordinator.GroupCoordinatorResponseTest > testHeartbeatMaintainsSession PASSED

kafka.coordinator.GroupCoordinatorResponseTest > testJoinGroupFromUnchangedLeaderShouldRebalance
PASSED

kafka.coordinator.GroupCoordinatorResponseTest > testHeartbeatRebalanceInProgress PASSED

kafka.coordinator.GroupCoordinatorResponseTest > testLeaveGroupUnknownGroup PASSED

kafka.coordinator.GroupCoordinatorResponseTest > testListGroupsIncludesRebalancingGroups
PASSED

kafka.coordinator.GroupCoordinatorResponseTest > testSyncGroupFollowerAfterLeader PASSED

kafka.coordinator.GroupCoordinatorResponseTest > testCommitOffsetInAwaitingSync PASSED

kafka.coordinator.GroupCoordinatorResponseTest > testJoinGroupWrongCoordinator PASSED

kafka.coordinator.GroupCoordinatorResponseTest > testJoinGroupUnknownConsumerExistingGroup
PASSED

kafka.coordinator.GroupCoordinatorResponseTest > testSyncGroupFromUnknownGroup PASSED

kafka.coordinator.GroupCoordinatorResponseTest > testJoinGroupInconsistentProtocolType
PASSED

kafka.coordinator.GroupCoordinatorResponseTest > testCommitOffsetFromUnknownGroup PASSED

kafka.coordinator.GroupCoordinatorResponseTest > testLeaveGroupWrongCoordinator PASSED

kafka.coordinator.GroupCoordinatorResponseTest > testCommitMaintainsSession PASSED

kafka.coordinator.GroupCoordinatorResponseTest > testLeaveGroupUnknownConsumerExistingGroup
PASSED

kafka.coordinator.GroupCoordinatorResponseTest > testJoinGroupUnknownConsumerNewGroup PASSED

kafka.coordinator.GroupCoordinatorResponseTest > testJoinGroupFromUnchangedFollowerDoesNotRebalance
PASSED

kafka.coordinator.GroupCoordinatorResponseTest > testValidJoinGroup PASSED

kafka.coordinator.GroupCoordinatorResponseTest > testSyncGroupLeaderAfterFollower PASSED

kafka.coordinator.GroupCoordinatorResponseTest > testSyncGroupFromUnknownMember PASSED

kafka.coordinator.GroupCoordinatorResponseTest > testValidLeaveGroup PASSED

kafka.coordinator.GroupCoordinatorResponseTest > testDescribeGroupInactiveGroup PASSED

kafka.coordinator.GroupCoordinatorResponseTest > testSyncGroupNotCoordinator PASSED

kafka.coordinator.GroupCoordinatorResponseTest > testHeartbeatUnknownConsumerExistingGroup
PASSED

kafka.coordinator.GroupCoordinatorResponseTest > testValidHeartbeat PASSED

kafka.coordinator.MemberMetadataTest > testMatchesSupportedProtocols PASSED

kafka.coordinator.MemberMetadataTest > testMetadata PASSED

kafka.coordinator.MemberMetadataTest > testMetadataRaisesOnUnsupportedProtocol PASSED

kafka.coordinator.MemberMetadataTest > testVoteForPreferredProtocol PASSED

kafka.coordinator.MemberMetadataTest > testVoteRaisesOnNoSupportedProtocols PASSED

kafka.coordinator.GroupMetadataTest > testDeadToAwaitingSyncIllegalTransition PASSED

kafka.coordinator.GroupMetadataTest > testPreparingRebalanceToStableIllegalTransition PASSED

kafka.coordinator.GroupMetadataTest > testCannotRebalanceWhenDead PASSED

kafka.coordinator.GroupMetadataTest > testSelectProtocol PASSED

kafka.coordinator.GroupMetadataTest > testCannotRebalanceWhenPreparingRebalance PASSED

kafka.coordinator.GroupMetadataTest > testDeadToPreparingRebalanceIllegalTransition PASSED

kafka.coordinator.GroupMetadataTest > testCanRebalanceWhenAwaitingSync PASSED

kafka.coordinator.GroupMetadataTest > testAwaitingSyncToPreparingRebalanceTransition PASSED

kafka.coordinator.GroupMetadataTest > testStableToAwaitingSyncIllegalTransition PASSED

kafka.coordinator.GroupMetadataTest > testDeadToDeadIllegalTransition PASSED

kafka.coordinator.GroupMetadataTest > testSelectProtocolRaisesIfNoMembers PASSED

kafka.coordinator.GroupMetadataTest > testStableToPreparingRebalanceTransition PASSED

kafka.coordinator.GroupMetadataTest > testPreparingRebalanceToDeadTransition PASSED

kafka.coordinator.GroupMetadataTest > testStableToStableIllegalTransition PASSED

kafka.coordinator.GroupMetadataTest > testAwaitingSyncToStableTransition PASSED

kafka.coordinator.GroupMetadataTest > testDeadToStableIllegalTransition PASSED

kafka.coordinator.GroupMetadataTest > testAwaitingSyncToAwaitingSyncIllegalTransition PASSED

kafka.coordinator.GroupMetadataTest > testSupportsProtocols PASSED

kafka.coordinator.GroupMetadataTest > testCanRebalanceWhenStable PASSED

kafka.coordinator.GroupMetadataTest > testPreparingRebalanceToPreparingRebalanceIllegalTransition
PASSED

kafka.coordinator.GroupMetadataTest > testSelectProtocolChoosesCompatibleProtocol PASSED

kafka.javaapi.message.ByteBufferMessageSetTest > testSizeInBytesWithCompression PASSED

kafka.javaapi.message.ByteBufferMessageSetTest > testIteratorIsConsistentWithCompression
PASSED

kafka.javaapi.message.ByteBufferMessageSetTest > testIteratorIsConsistent PASSED

kafka.javaapi.message.ByteBufferMessageSetTest > testEqualsWithCompression PASSED

kafka.javaapi.message.ByteBufferMessageSetTest > testWrittenEqualsRead PASSED

kafka.javaapi.message.ByteBufferMessageSetTest > testEquals PASSED

kafka.javaapi.message.ByteBufferMessageSetTest > testSizeInBytes PASSED

kafka.javaapi.consumer.ZookeeperConsumerConnectorTest > testBasic PASSED

kafka.KafkaTest > testGetKafkaConfigFromArgsWrongSetValue PASSED

kafka.KafkaTest > testKafkaSslPasswords PASSED

kafka.KafkaTest > testGetKafkaConfigFromArgs PASSED

kafka.KafkaTest > testGetKafkaConfigFromArgsNonArgsAtTheEnd PASSED

kafka.KafkaTest > testGetKafkaConfigFromArgsNonArgsOnly PASSED

kafka.KafkaTest > testGetKafkaConfigFromArgsNonArgsAtTheBegging PASSED

kafka.controller.ControllerFailoverTest > testMetadataUpdate PASSED
:test_core_2_10 FAILED

FAILURE: Build failed with an exception.

* What went wrong:
Failed to capture snapshot of output files for task 'test' during up-to-date check.
> Could not add entry '<https://builds.apache.org/job/kafka-trunk-jdk8/ws/core/build/reports/tests/classes/kafka.server.SaslApiVersionsRequestTest.html'>
to cache fileHashes.bin (<https://builds.apache.org/job/kafka-trunk-jdk8/ws/.gradle/2.13/taskArtifacts/fileHashes.bin).>

* Try:
Run with --stacktrace option to get the stack trace. Run with --info or --debug option to
get more log output.

BUILD FAILED

Total time: 57 mins 39.196 secs
Build step 'Execute shell' marked build as failure
Recording test results
Setting GRADLE_2_4_RC_2_HOME=/home/jenkins/jenkins-slave/tools/hudson.plugins.gradle.GradleInstallation/Gradle_2.4-rc-2
Setting JDK1_8_0_66_HOME=/home/jenkins/jenkins-slave/tools/hudson.model.JDK/jdk1.8.0_66
Setting GRADLE_2_4_RC_2_HOME=/home/jenkins/jenkins-slave/tools/hudson.plugins.gradle.GradleInstallation/Gradle_2.4-rc-2
Setting JDK1_8_0_66_HOME=/home/jenkins/jenkins-slave/tools/hudson.model.JDK/jdk1.8.0_66

Mime
View raw message