kafka-dev mailing list archives

Site index · List index
Message view « Date » · « Thread »
Top « Date » · « Thread »
From Apache Jenkins Server <jenk...@builds.apache.org>
Subject Build failed in Jenkins: kafka-trunk-jdk8 #653
Date Thu, 26 May 2016 22:22:58 GMT
See <https://builds.apache.org/job/kafka-trunk-jdk8/653/changes>

Changes:

[me] KAFKA-3723: Cannot change size of schema cache for JSON converter

------------------------------------------
Started by an SCM change
[EnvInject] - Loading node environment variables.
Building remotely on ubuntu-4 (docker Ubuntu ubuntu4 ubuntu yahoo-not-h2) in workspace <https://builds.apache.org/job/kafka-trunk-jdk8/ws/>
 > git rev-parse --is-inside-work-tree # timeout=10
Fetching changes from the remote Git repository
 > git config remote.origin.url https://git-wip-us.apache.org/repos/asf/kafka.git # timeout=10
Fetching upstream changes from https://git-wip-us.apache.org/repos/asf/kafka.git
 > git --version # timeout=10
 > git -c core.askpass=true fetch --tags --progress https://git-wip-us.apache.org/repos/asf/kafka.git
+refs/heads/*:refs/remotes/origin/*
 > git rev-parse refs/remotes/origin/trunk^{commit} # timeout=10
 > git rev-parse refs/remotes/origin/origin/trunk^{commit} # timeout=10
Checking out Revision 3cf2de0694cf0e276d25d8c7048a9928b41969a3 (refs/remotes/origin/trunk)
 > git config core.sparsecheckout # timeout=10
 > git checkout -f 3cf2de0694cf0e276d25d8c7048a9928b41969a3
 > git rev-list d5366471d2c1a611f2241362041debc0118e5422 # timeout=10
Setting GRADLE_2_4_RC_2_HOME=/home/jenkins/jenkins-slave/tools/hudson.plugins.gradle.GradleInstallation/Gradle_2.4-rc-2
Setting JDK1_8_0_66_HOME=/home/jenkins/jenkins-slave/tools/hudson.model.JDK/jdk1.8.0_66
[kafka-trunk-jdk8] $ /bin/bash -xe /tmp/hudson4360967715551164531.sh
+ /home/jenkins/jenkins-slave/tools/hudson.plugins.gradle.GradleInstallation/Gradle_2.4-rc-2/bin/gradle
To honour the JVM settings for this build a new JVM will be forked. Please consider using
the daemon: http://gradle.org/docs/2.4-rc-2/userguide/gradle_daemon.html.
Building project 'core' with Scala version 2.10.6
:downloadWrapper

BUILD SUCCESSFUL

Total time: 29.812 secs
Setting GRADLE_2_4_RC_2_HOME=/home/jenkins/jenkins-slave/tools/hudson.plugins.gradle.GradleInstallation/Gradle_2.4-rc-2
Setting JDK1_8_0_66_HOME=/home/jenkins/jenkins-slave/tools/hudson.model.JDK/jdk1.8.0_66
[kafka-trunk-jdk8] $ /bin/bash -xe /tmp/hudson5697358019448268335.sh
+ export GRADLE_OPTS=-Xmx1024m
+ GRADLE_OPTS=-Xmx1024m
+ ./gradlew -Dorg.gradle.project.maxParallelForks=1 clean jarAll testAll
To honour the JVM settings for this build a new JVM will be forked. Please consider using
the daemon: https://docs.gradle.org/2.13/userguide/gradle_daemon.html.
Building project 'core' with Scala version 2.10.6
Build file '<https://builds.apache.org/job/kafka-trunk-jdk8/ws/build.gradle'>: line
231
useAnt has been deprecated and is scheduled to be removed in Gradle 3.0. The Ant-Based Scala
compiler is deprecated, please see https://docs.gradle.org/current/userguide/scala_plugin.html.
:clean UP-TO-DATE
:clients:clean
:connect:clean UP-TO-DATE
:core:clean
:examples:clean UP-TO-DATE
:log4j-appender:clean UP-TO-DATE
:streams:clean UP-TO-DATE
:tools:clean UP-TO-DATE
:connect:api:clean UP-TO-DATE
:connect:file:clean UP-TO-DATE
:connect:json:clean UP-TO-DATE
:connect:runtime:clean UP-TO-DATE
:streams:examples:clean UP-TO-DATE
:jar_core_2_10
Building project 'core' with Scala version 2.10.6
:kafka-trunk-jdk8:clients:compileJavawarning: [options] bootstrap class path not set in conjunction
with -source 1.7
Note: Some input files use unchecked or unsafe operations.
Note: Recompile with -Xlint:unchecked for details.
1 warning

:kafka-trunk-jdk8:clients:processResources UP-TO-DATE
:kafka-trunk-jdk8:clients:classes
:kafka-trunk-jdk8:clients:determineCommitId UP-TO-DATE
:kafka-trunk-jdk8:clients:createVersionFile
:kafka-trunk-jdk8:clients:jar
:kafka-trunk-jdk8:core:compileJava UP-TO-DATE
:kafka-trunk-jdk8:core:compileScalaJava HotSpot(TM) 64-Bit Server VM warning: ignoring option
MaxPermSize=512m; support was removed in 8.0

<https://builds.apache.org/job/kafka-trunk-jdk8/ws/core/src/main/scala/kafka/api/OffsetCommitRequest.scala>:79:
value DEFAULT_TIMESTAMP in object OffsetCommitRequest is deprecated: see corresponding Javadoc
for more information.
            org.apache.kafka.common.requests.OffsetCommitRequest.DEFAULT_TIMESTAMP
                                                                 ^
<https://builds.apache.org/job/kafka-trunk-jdk8/ws/core/src/main/scala/kafka/common/OffsetMetadataAndError.scala>:36:
value DEFAULT_TIMESTAMP in object OffsetCommitRequest is deprecated: see corresponding Javadoc
for more information.
                             commitTimestamp: Long = org.apache.kafka.common.requests.OffsetCommitRequest.DEFAULT_TIMESTAMP,
                                                                                         
                ^
<https://builds.apache.org/job/kafka-trunk-jdk8/ws/core/src/main/scala/kafka/common/OffsetMetadataAndError.scala>:37:
value DEFAULT_TIMESTAMP in object OffsetCommitRequest is deprecated: see corresponding Javadoc
for more information.
                             expireTimestamp: Long = org.apache.kafka.common.requests.OffsetCommitRequest.DEFAULT_TIMESTAMP)
{
                                                                                         
                ^
<https://builds.apache.org/job/kafka-trunk-jdk8/ws/core/src/main/scala/kafka/coordinator/GroupMetadataManager.scala>:401:
value DEFAULT_TIMESTAMP in object OffsetCommitRequest is deprecated: see corresponding Javadoc
for more information.
                          if (value.expireTimestamp == org.apache.kafka.common.requests.OffsetCommitRequest.DEFAULT_TIMESTAMP)
                                                                                         
                  ^
<https://builds.apache.org/job/kafka-trunk-jdk8/ws/core/src/main/scala/kafka/server/KafkaApis.scala>:301:
value DEFAULT_TIMESTAMP in object OffsetCommitRequest is deprecated: see corresponding Javadoc
for more information.
              if (partitionData.timestamp == OffsetCommitRequest.DEFAULT_TIMESTAMP)
                                                                 ^
<https://builds.apache.org/job/kafka-trunk-jdk8/ws/core/src/main/scala/kafka/client/ClientUtils.scala>:93:
class ProducerConfig in package producer is deprecated: This class has been deprecated and
will be removed in a future release. Please use org.apache.kafka.clients.producer.ProducerConfig
instead.
    val producerConfig = new ProducerConfig(props)
                             ^
<https://builds.apache.org/job/kafka-trunk-jdk8/ws/core/src/main/scala/kafka/client/ClientUtils.scala>:94:
method fetchTopicMetadata in object ClientUtils is deprecated: This method has been deprecated
and will be removed in a future release.
    fetchTopicMetadata(topics, brokers, producerConfig, correlationId)
    ^
<https://builds.apache.org/job/kafka-trunk-jdk8/ws/core/src/main/scala/kafka/controller/ControllerChannelManager.scala>:396:
constructor UpdateMetadataRequest in class UpdateMetadataRequest is deprecated: see corresponding
Javadoc for more information.
            new UpdateMetadataRequest(controllerId, controllerEpoch, liveBrokers.asJava, partitionStates.asJava)
            ^
<https://builds.apache.org/job/kafka-trunk-jdk8/ws/core/src/main/scala/kafka/metrics/KafkaMetricsGroup.scala>:191:
object ProducerRequestStatsRegistry in package producer is deprecated: This object has been
deprecated and will be removed in a future release.
    ProducerRequestStatsRegistry.removeProducerRequestStats(clientId)
    ^
<https://builds.apache.org/job/kafka-trunk-jdk8/ws/core/src/main/scala/kafka/network/BlockingChannel.scala>:129:
method readFromReadableChannel in class NetworkReceive is deprecated: see corresponding Javadoc
for more information.
      response.readFromReadableChannel(channel)
               ^
<https://builds.apache.org/job/kafka-trunk-jdk8/ws/core/src/main/scala/kafka/server/KafkaApis.scala>:301:
value timestamp in class PartitionData is deprecated: see corresponding Javadoc for more information.
              if (partitionData.timestamp == OffsetCommitRequest.DEFAULT_TIMESTAMP)
                                ^
<https://builds.apache.org/job/kafka-trunk-jdk8/ws/core/src/main/scala/kafka/server/KafkaApis.scala>:304:
value timestamp in class PartitionData is deprecated: see corresponding Javadoc for more information.
                offsetRetention + partitionData.timestamp
                                                ^
<https://builds.apache.org/job/kafka-trunk-jdk8/ws/core/src/main/scala/kafka/tools/ConsoleProducer.scala>:43:
class OldProducer in package producer is deprecated: This class has been deprecated and will
be removed in a future release. Please use org.apache.kafka.clients.producer.KafkaProducer
instead.
            new OldProducer(getOldProducerProps(config))
                ^
<https://builds.apache.org/job/kafka-trunk-jdk8/ws/core/src/main/scala/kafka/tools/ConsoleProducer.scala>:45:
class NewShinyProducer in package producer is deprecated: This class has been deprecated and
will be removed in a future release. Please use org.apache.kafka.clients.producer.KafkaProducer
instead.
            new NewShinyProducer(getNewProducerProps(config))
                ^
14 warnings found
warning: [options] bootstrap class path not set in conjunction with -source 1.7
1 warning
:jar_core_2_10 FAILED

FAILURE: Build failed with an exception.

* What went wrong:
Failed to capture snapshot of output files for task 'compileScala' during up-to-date check.
> Could not add entry '<https://builds.apache.org/job/kafka-trunk-jdk8/ws/core/build/classes/main/kafka/server/ReplicaManager$$anonfun$22$$anonfun$apply$23.class'>
to cache fileHashes.bin (<https://builds.apache.org/job/kafka-trunk-jdk8/ws/.gradle/2.13/taskArtifacts/fileHashes.bin).>

* Try:
Run with --stacktrace option to get the stack trace. Run with --info or --debug option to
get more log output.

BUILD FAILED

Total time: 2 mins 57.426 secs
Build step 'Execute shell' marked build as failure
Recording test results
Setting GRADLE_2_4_RC_2_HOME=/home/jenkins/jenkins-slave/tools/hudson.plugins.gradle.GradleInstallation/Gradle_2.4-rc-2
Setting JDK1_8_0_66_HOME=/home/jenkins/jenkins-slave/tools/hudson.model.JDK/jdk1.8.0_66
ERROR: Step ?Publish JUnit test result report? failed: No test report files were found. Configuration
error?
Setting GRADLE_2_4_RC_2_HOME=/home/jenkins/jenkins-slave/tools/hudson.plugins.gradle.GradleInstallation/Gradle_2.4-rc-2
Setting JDK1_8_0_66_HOME=/home/jenkins/jenkins-slave/tools/hudson.model.JDK/jdk1.8.0_66

Mime
View raw message