kafka-dev mailing list archives

Site index · List index
Message view « Date » · « Thread »
Top « Date » · « Thread »
From Apache Jenkins Server <jenk...@builds.apache.org>
Subject Build failed in Jenkins: kafka-0.10.0-jdk7 #54
Date Thu, 05 May 2016 21:50:23 GMT
See <https://builds.apache.org/job/kafka-0.10.0-jdk7/54/changes>

Changes:

[me] KAFKA-3581: add timeouts to joins in background thread services

------------------------------------------
[...truncated 8731 lines...]

org.apache.kafka.connect.storage.KafkaStatusBackingStoreTest > readConnectorState PASSED

org.apache.kafka.connect.storage.KafkaStatusBackingStoreTest > putSafeConnectorIgnoresStaleStatus
PASSED

org.apache.kafka.connect.storage.KafkaStatusBackingStoreTest > putConnectorState PASSED

org.apache.kafka.connect.storage.MemoryStatusBackingStoreTest > putAndGetConnectorStatus
PASSED

org.apache.kafka.connect.storage.MemoryStatusBackingStoreTest > putAndGetTaskStatus PASSED

org.apache.kafka.connect.storage.MemoryStatusBackingStoreTest > deleteTaskStatus PASSED

org.apache.kafka.connect.storage.MemoryStatusBackingStoreTest > deleteConnectorStatus PASSED

org.apache.kafka.connect.storage.OffsetStorageWriterTest > testNoOffsetsToFlush PASSED

org.apache.kafka.connect.storage.OffsetStorageWriterTest > testFlushFailureReplacesOffsets
PASSED

org.apache.kafka.connect.storage.OffsetStorageWriterTest > testAlreadyFlushing PASSED

org.apache.kafka.connect.storage.OffsetStorageWriterTest > testCancelBeforeAwaitFlush PASSED

org.apache.kafka.connect.storage.OffsetStorageWriterTest > testCancelAfterAwaitFlush PASSED

org.apache.kafka.connect.storage.OffsetStorageWriterTest > testWriteFlush PASSED

org.apache.kafka.connect.storage.OffsetStorageWriterTest > testWriteNullValueFlush PASSED

org.apache.kafka.connect.storage.OffsetStorageWriterTest > testWriteNullKeyFlush PASSED

org.apache.kafka.connect.storage.FileOffsetBackingStoreTest > testSaveRestore PASSED

org.apache.kafka.connect.storage.FileOffsetBackingStoreTest > testGetSet PASSED

org.apache.kafka.connect.storage.KafkaConfigBackingStoreTest > testPutConnectorConfig PASSED

org.apache.kafka.connect.storage.KafkaConfigBackingStoreTest > testPutTaskConfigs PASSED

org.apache.kafka.connect.storage.KafkaConfigBackingStoreTest > testPutTaskConfigsDoesNotResolveAllInconsistencies
PASSED

org.apache.kafka.connect.storage.KafkaConfigBackingStoreTest > testPutTaskConfigsZeroTasks
PASSED

org.apache.kafka.connect.storage.KafkaConfigBackingStoreTest > testRestoreZeroTasks PASSED

org.apache.kafka.connect.storage.KafkaConfigBackingStoreTest > testStartStop PASSED

org.apache.kafka.connect.storage.KafkaConfigBackingStoreTest > testRestore PASSED
:streams:examples:checkstyleMain
:streams:examples:compileTestJava UP-TO-DATE
:streams:examples:processTestResources UP-TO-DATE
:streams:examples:testClasses UP-TO-DATE
:streams:examples:checkstyleTest UP-TO-DATE
:streams:examples:test UP-TO-DATE
:testAll

BUILD SUCCESSFUL

Total time: 1 hrs 1 mins 36.791 secs
+ ./gradlew --stacktrace docsJarAll
To honour the JVM settings for this build a new JVM will be forked. Please consider using
the daemon: https://docs.gradle.org/2.13/userguide/gradle_daemon.html.
Building project 'core' with Scala version 2.10.6
Build file '<https://builds.apache.org/job/kafka-0.10.0-jdk7/ws/build.gradle'>: line
230
useAnt has been deprecated and is scheduled to be removed in Gradle 3.0. The Ant-Based Scala
compiler is deprecated, please see https://docs.gradle.org/current/userguide/scala_plugin.html.
:docsJar_2_10
Building project 'core' with Scala version 2.10.6
:kafka-0.10.0-jdk7:clients:compileJava UP-TO-DATE
:kafka-0.10.0-jdk7:clients:processResources UP-TO-DATE
:kafka-0.10.0-jdk7:clients:classes UP-TO-DATE
:kafka-0.10.0-jdk7:clients:determineCommitId UP-TO-DATE
:kafka-0.10.0-jdk7:clients:createVersionFile
:kafka-0.10.0-jdk7:clients:jar UP-TO-DATE
:kafka-0.10.0-jdk7:clients:javadoc
:docsJar_2_10 FAILED

FAILURE: Build failed with an exception.

* What went wrong:
Failed to capture snapshot of output files for task 'javadoc' during up-to-date check.
> Could not add entry '<https://builds.apache.org/job/kafka-0.10.0-jdk7/ws/clients/build/docs/javadoc/deprecated-list.html'>
to cache fileHashes.bin (<https://builds.apache.org/job/kafka-0.10.0-jdk7/ws/.gradle/2.13/taskArtifacts/fileHashes.bin).>

* Try:
Run with --info or --debug option to get more log output.

* Exception is:
org.gradle.api.UncheckedIOException: Failed to capture snapshot of output files for task 'javadoc'
during up-to-date check.
	at org.gradle.api.internal.changedetection.rules.AbstractFileSnapshotTaskStateChanges.createSnapshot(AbstractFileSnapshotTaskStateChanges.java:49)
	at org.gradle.api.internal.changedetection.rules.OutputFilesTaskStateChanges.saveCurrent(OutputFilesTaskStateChanges.java:71)
	at org.gradle.api.internal.changedetection.rules.AbstractFileSnapshotTaskStateChanges.snapshotAfterTask(AbstractFileSnapshotTaskStateChanges.java:77)
	at org.gradle.api.internal.changedetection.rules.OutputFilesTaskStateChanges.snapshotAfterTask(OutputFilesTaskStateChanges.java:26)
	at org.gradle.api.internal.changedetection.rules.CachingTaskStateChanges.snapshotAfterTask(CachingTaskStateChanges.java:84)
	at org.gradle.api.internal.changedetection.rules.SummaryTaskStateChanges.snapshotAfterTask(SummaryTaskStateChanges.java:73)
	at org.gradle.api.internal.changedetection.changes.DefaultTaskArtifactStateRepository$TaskArtifactStateImpl.afterTask(DefaultTaskArtifactStateRepository.java:132)
	at org.gradle.api.internal.tasks.execution.SkipUpToDateTaskExecuter.execute(SkipUpToDateTaskExecuter.java:70)
	at org.gradle.api.internal.tasks.execution.ValidatingTaskExecuter.execute(ValidatingTaskExecuter.java:58)
	at org.gradle.api.internal.tasks.execution.SkipEmptySourceFilesTaskExecuter.execute(SkipEmptySourceFilesTaskExecuter.java:52)
	at org.gradle.api.internal.tasks.execution.SkipTaskWithNoActionsExecuter.execute(SkipTaskWithNoActionsExecuter.java:52)
	at org.gradle.api.internal.tasks.execution.SkipOnlyIfTaskExecuter.execute(SkipOnlyIfTaskExecuter.java:53)
	at org.gradle.api.internal.tasks.execution.ExecuteAtMostOnceTaskExecuter.execute(ExecuteAtMostOnceTaskExecuter.java:43)
	at org.gradle.execution.taskgraph.DefaultTaskGraphExecuter$EventFiringTaskWorker.execute(DefaultTaskGraphExecuter.java:203)
	at org.gradle.execution.taskgraph.DefaultTaskGraphExecuter$EventFiringTaskWorker.execute(DefaultTaskGraphExecuter.java:185)
	at org.gradle.execution.taskgraph.AbstractTaskPlanExecutor$TaskExecutorWorker.processTask(AbstractTaskPlanExecutor.java:66)
	at org.gradle.execution.taskgraph.AbstractTaskPlanExecutor$TaskExecutorWorker.run(AbstractTaskPlanExecutor.java:50)
	at org.gradle.execution.taskgraph.DefaultTaskPlanExecutor.process(DefaultTaskPlanExecutor.java:25)
	at org.gradle.execution.taskgraph.DefaultTaskGraphExecuter.execute(DefaultTaskGraphExecuter.java:110)
	at org.gradle.execution.SelectedTaskExecutionAction.execute(SelectedTaskExecutionAction.java:37)
	at org.gradle.execution.DefaultBuildExecuter.execute(DefaultBuildExecuter.java:37)
	at org.gradle.execution.DefaultBuildExecuter.access$000(DefaultBuildExecuter.java:23)
	at org.gradle.execution.DefaultBuildExecuter$1.proceed(DefaultBuildExecuter.java:43)
	at org.gradle.execution.DryRunBuildExecutionAction.execute(DryRunBuildExecutionAction.java:32)
	at org.gradle.execution.DefaultBuildExecuter.execute(DefaultBuildExecuter.java:37)
	at org.gradle.execution.DefaultBuildExecuter.execute(DefaultBuildExecuter.java:30)
	at org.gradle.initialization.DefaultGradleLauncher$4.run(DefaultGradleLauncher.java:154)
	at org.gradle.internal.Factories$1.create(Factories.java:22)
	at org.gradle.internal.progress.DefaultBuildOperationExecutor.run(DefaultBuildOperationExecutor.java:90)
	at org.gradle.internal.progress.DefaultBuildOperationExecutor.run(DefaultBuildOperationExecutor.java:52)
	at org.gradle.initialization.DefaultGradleLauncher.doBuildStages(DefaultGradleLauncher.java:151)
	at org.gradle.initialization.DefaultGradleLauncher.access$200(DefaultGradleLauncher.java:32)
	at org.gradle.initialization.DefaultGradleLauncher$1.create(DefaultGradleLauncher.java:99)
	at org.gradle.initialization.DefaultGradleLauncher$1.create(DefaultGradleLauncher.java:93)
	at org.gradle.internal.progress.DefaultBuildOperationExecutor.run(DefaultBuildOperationExecutor.java:90)
	at org.gradle.internal.progress.DefaultBuildOperationExecutor.run(DefaultBuildOperationExecutor.java:62)
	at org.gradle.initialization.DefaultGradleLauncher.doBuild(DefaultGradleLauncher.java:93)
	at org.gradle.initialization.DefaultGradleLauncher.run(DefaultGradleLauncher.java:82)
	at org.gradle.api.tasks.GradleBuild.build(GradleBuild.java:117)
	at org.gradle.internal.reflect.JavaMethod.invoke(JavaMethod.java:75)
	at org.gradle.api.internal.project.taskfactory.AnnotationProcessingTaskFactory$StandardTaskAction.doExecute(AnnotationProcessingTaskFactory.java:228)
	at org.gradle.api.internal.project.taskfactory.AnnotationProcessingTaskFactory$StandardTaskAction.execute(AnnotationProcessingTaskFactory.java:221)
	at org.gradle.api.internal.project.taskfactory.AnnotationProcessingTaskFactory$StandardTaskAction.execute(AnnotationProcessingTaskFactory.java:210)
	at org.gradle.api.internal.AbstractTask$TaskActionWrapper.execute(AbstractTask.java:585)
	at org.gradle.api.internal.AbstractTask$TaskActionWrapper.execute(AbstractTask.java:568)
	at org.gradle.api.internal.tasks.execution.ExecuteActionsTaskExecuter.executeAction(ExecuteActionsTaskExecuter.java:80)
	at org.gradle.api.internal.tasks.execution.ExecuteActionsTaskExecuter.executeActions(ExecuteActionsTaskExecuter.java:61)
	at org.gradle.api.internal.tasks.execution.ExecuteActionsTaskExecuter.execute(ExecuteActionsTaskExecuter.java:46)
	at org.gradle.api.internal.tasks.execution.PostExecutionAnalysisTaskExecuter.execute(PostExecutionAnalysisTaskExecuter.java:35)
	at org.gradle.api.internal.tasks.execution.SkipUpToDateTaskExecuter.execute(SkipUpToDateTaskExecuter.java:68)
	at org.gradle.api.internal.tasks.execution.ValidatingTaskExecuter.execute(ValidatingTaskExecuter.java:58)
	at org.gradle.api.internal.tasks.execution.SkipEmptySourceFilesTaskExecuter.execute(SkipEmptySourceFilesTaskExecuter.java:52)
	at org.gradle.api.internal.tasks.execution.SkipTaskWithNoActionsExecuter.execute(SkipTaskWithNoActionsExecuter.java:52)
	at org.gradle.api.internal.tasks.execution.SkipOnlyIfTaskExecuter.execute(SkipOnlyIfTaskExecuter.java:53)
	at org.gradle.api.internal.tasks.execution.ExecuteAtMostOnceTaskExecuter.execute(ExecuteAtMostOnceTaskExecuter.java:43)
	at org.gradle.execution.taskgraph.DefaultTaskGraphExecuter$EventFiringTaskWorker.execute(DefaultTaskGraphExecuter.java:203)
	at org.gradle.execution.taskgraph.DefaultTaskGraphExecuter$EventFiringTaskWorker.execute(DefaultTaskGraphExecuter.java:185)
	at org.gradle.execution.taskgraph.AbstractTaskPlanExecutor$TaskExecutorWorker.processTask(AbstractTaskPlanExecutor.java:66)
	at org.gradle.execution.taskgraph.AbstractTaskPlanExecutor$TaskExecutorWorker.run(AbstractTaskPlanExecutor.java:50)
	at org.gradle.execution.taskgraph.DefaultTaskPlanExecutor.process(DefaultTaskPlanExecutor.java:25)
	at org.gradle.execution.taskgraph.DefaultTaskGraphExecuter.execute(DefaultTaskGraphExecuter.java:110)
	at org.gradle.execution.SelectedTaskExecutionAction.execute(SelectedTaskExecutionAction.java:37)
	at org.gradle.execution.DefaultBuildExecuter.execute(DefaultBuildExecuter.java:37)
	at org.gradle.execution.DefaultBuildExecuter.access$000(DefaultBuildExecuter.java:23)
	at org.gradle.execution.DefaultBuildExecuter$1.proceed(DefaultBuildExecuter.java:43)
	at org.gradle.execution.DryRunBuildExecutionAction.execute(DryRunBuildExecutionAction.java:32)
	at org.gradle.execution.DefaultBuildExecuter.execute(DefaultBuildExecuter.java:37)
	at org.gradle.execution.DefaultBuildExecuter.execute(DefaultBuildExecuter.java:30)
	at org.gradle.initialization.DefaultGradleLauncher$4.run(DefaultGradleLauncher.java:154)
	at org.gradle.internal.Factories$1.create(Factories.java:22)
	at org.gradle.internal.progress.DefaultBuildOperationExecutor.run(DefaultBuildOperationExecutor.java:90)
	at org.gradle.internal.progress.DefaultBuildOperationExecutor.run(DefaultBuildOperationExecutor.java:52)
	at org.gradle.initialization.DefaultGradleLauncher.doBuildStages(DefaultGradleLauncher.java:151)
	at org.gradle.initialization.DefaultGradleLauncher.access$200(DefaultGradleLauncher.java:32)
	at org.gradle.initialization.DefaultGradleLauncher$1.create(DefaultGradleLauncher.java:99)
	at org.gradle.initialization.DefaultGradleLauncher$1.create(DefaultGradleLauncher.java:93)
	at org.gradle.internal.progress.DefaultBuildOperationExecutor.run(DefaultBuildOperationExecutor.java:90)
	at org.gradle.internal.progress.DefaultBuildOperationExecutor.run(DefaultBuildOperationExecutor.java:62)
	at org.gradle.initialization.DefaultGradleLauncher.doBuild(DefaultGradleLauncher.java:93)
	at org.gradle.initialization.DefaultGradleLauncher.run(DefaultGradleLauncher.java:82)
	at org.gradle.launcher.exec.InProcessBuildActionExecuter$DefaultBuildController.run(InProcessBuildActionExecuter.java:94)
	at org.gradle.tooling.internal.provider.ExecuteBuildActionRunner.run(ExecuteBuildActionRunner.java:28)
	at org.gradle.launcher.exec.ChainingBuildActionRunner.run(ChainingBuildActionRunner.java:35)
	at org.gradle.launcher.exec.InProcessBuildActionExecuter.execute(InProcessBuildActionExecuter.java:43)
	at org.gradle.launcher.exec.InProcessBuildActionExecuter.execute(InProcessBuildActionExecuter.java:28)
	at org.gradle.launcher.exec.ContinuousBuildActionExecuter.execute(ContinuousBuildActionExecuter.java:81)
	at org.gradle.launcher.exec.ContinuousBuildActionExecuter.execute(ContinuousBuildActionExecuter.java:46)
	at org.gradle.launcher.daemon.server.exec.ExecuteBuild.doBuild(ExecuteBuild.java:52)
	at org.gradle.launcher.daemon.server.exec.BuildCommandOnly.execute(BuildCommandOnly.java:36)
	at org.gradle.launcher.daemon.server.api.DaemonCommandExecution.proceed(DaemonCommandExecution.java:120)
	at org.gradle.launcher.daemon.server.exec.WatchForDisconnection.execute(WatchForDisconnection.java:37)
	at org.gradle.launcher.daemon.server.api.DaemonCommandExecution.proceed(DaemonCommandExecution.java:120)
	at org.gradle.launcher.daemon.server.exec.ResetDeprecationLogger.execute(ResetDeprecationLogger.java:26)
	at org.gradle.launcher.daemon.server.api.DaemonCommandExecution.proceed(DaemonCommandExecution.java:120)
	at org.gradle.launcher.daemon.server.exec.RequestStopIfSingleUsedDaemon.execute(RequestStopIfSingleUsedDaemon.java:34)
	at org.gradle.launcher.daemon.server.api.DaemonCommandExecution.proceed(DaemonCommandExecution.java:120)
	at org.gradle.launcher.daemon.server.exec.ForwardClientInput$2.call(ForwardClientInput.java:74)
	at org.gradle.launcher.daemon.server.exec.ForwardClientInput$2.call(ForwardClientInput.java:72)
	at org.gradle.util.Swapper.swap(Swapper.java:38)
	at org.gradle.launcher.daemon.server.exec.ForwardClientInput.execute(ForwardClientInput.java:72)
	at org.gradle.launcher.daemon.server.api.DaemonCommandExecution.proceed(DaemonCommandExecution.java:120)
	at org.gradle.launcher.daemon.server.health.DaemonHealthTracker.execute(DaemonHealthTracker.java:40)
	at org.gradle.launcher.daemon.server.api.DaemonCommandExecution.proceed(DaemonCommandExecution.java:120)
	at org.gradle.launcher.daemon.server.exec.LogToClient.doBuild(LogToClient.java:60)
	at org.gradle.launcher.daemon.server.exec.BuildCommandOnly.execute(BuildCommandOnly.java:36)
	at org.gradle.launcher.daemon.server.api.DaemonCommandExecution.proceed(DaemonCommandExecution.java:120)
	at org.gradle.launcher.daemon.server.exec.EstablishBuildEnvironment.doBuild(EstablishBuildEnvironment.java:72)
	at org.gradle.launcher.daemon.server.exec.BuildCommandOnly.execute(BuildCommandOnly.java:36)
	at org.gradle.launcher.daemon.server.api.DaemonCommandExecution.proceed(DaemonCommandExecution.java:120)
	at org.gradle.launcher.daemon.server.health.HintGCAfterBuild.execute(HintGCAfterBuild.java:41)
	at org.gradle.launcher.daemon.server.api.DaemonCommandExecution.proceed(DaemonCommandExecution.java:120)
	at org.gradle.launcher.daemon.server.exec.StartBuildOrRespondWithBusy$1.run(StartBuildOrRespondWithBusy.java:50)
	at org.gradle.launcher.daemon.server.DaemonStateCoordinator$1.run(DaemonStateCoordinator.java:246)
	at org.gradle.internal.concurrent.ExecutorPolicy$CatchAndRecordFailures.onExecute(ExecutorPolicy.java:54)
	at org.gradle.internal.concurrent.StoppableExecutorImpl$1.run(StoppableExecutorImpl.java:40)
Caused by: org.gradle.api.UncheckedIOException: Could not add entry '<https://builds.apache.org/job/kafka-0.10.0-jdk7/ws/clients/build/docs/javadoc/deprecated-list.html'>
to cache fileHashes.bin (<https://builds.apache.org/job/kafka-0.10.0-jdk7/ws/.gradle/2.13/taskArtifacts/fileHashes.bin).>
	at org.gradle.cache.internal.btree.BTreePersistentIndexedCache.put(BTreePersistentIndexedCache.java:155)
	at org.gradle.cache.internal.DefaultMultiProcessSafePersistentIndexedCache$2.run(DefaultMultiProcessSafePersistentIndexedCache.java:51)
	at org.gradle.cache.internal.DefaultFileLockManager$DefaultFileLock.doWriteAction(DefaultFileLockManager.java:173)
	at org.gradle.cache.internal.DefaultFileLockManager$DefaultFileLock.writeFile(DefaultFileLockManager.java:163)
	at org.gradle.cache.internal.DefaultCacheAccess$UnitOfWorkFileAccess.writeFile(DefaultCacheAccess.java:404)
	at org.gradle.cache.internal.DefaultMultiProcessSafePersistentIndexedCache.put(DefaultMultiProcessSafePersistentIndexedCache.java:49)
	at org.gradle.api.internal.changedetection.state.InMemoryTaskArtifactCache$1.put(InMemoryTaskArtifactCache.java:97)
	at org.gradle.api.internal.changedetection.state.CachingFileSnapshotter.snapshot(CachingFileSnapshotter.java:82)
	at org.gradle.api.internal.changedetection.state.CachingFileSnapshotter.snapshot(CachingFileSnapshotter.java:69)
	at org.gradle.api.internal.changedetection.state.CachingFileSnapshotter.snapshot(CachingFileSnapshotter.java:33)
	at org.gradle.api.internal.changedetection.state.AbstractFileCollectionSnapshotter$1.run(AbstractFileCollectionSnapshotter.java:73)
	at org.gradle.internal.Factories$1.create(Factories.java:22)
	at org.gradle.cache.internal.DefaultCacheAccess.useCache(DefaultCacheAccess.java:192)
	at org.gradle.cache.internal.DefaultCacheAccess.useCache(DefaultCacheAccess.java:175)
	at org.gradle.cache.internal.DefaultPersistentDirectoryStore.useCache(DefaultPersistentDirectoryStore.java:106)
	at org.gradle.cache.internal.DefaultCacheFactory$ReferenceTrackingCache.useCache(DefaultCacheFactory.java:187)
	at org.gradle.api.internal.changedetection.state.DefaultTaskArtifactStateCacheAccess.useCache(DefaultTaskArtifactStateCacheAccess.java:60)
	at org.gradle.api.internal.changedetection.state.AbstractFileCollectionSnapshotter.snapshot(AbstractFileCollectionSnapshotter.java:65)
	at org.gradle.api.internal.changedetection.state.DefaultFileCollectionSnapshotter.snapshot(DefaultFileCollectionSnapshotter.java:29)
	at org.gradle.api.internal.changedetection.state.OutputFilesCollectionSnapshotter.snapshot(OutputFilesCollectionSnapshotter.java:55)
	at org.gradle.api.internal.changedetection.state.OutputFilesCollectionSnapshotter.snapshot(OutputFilesCollectionSnapshotter.java:31)
	at org.gradle.api.internal.changedetection.rules.AbstractFileSnapshotTaskStateChanges.createSnapshot(AbstractFileSnapshotTaskStateChanges.java:47)
	... 114 more
Caused by: org.gradle.cache.internal.btree.CorruptedCacheException: Corrupted FreeListBlock
782531 found in cache '<https://builds.apache.org/job/kafka-0.10.0-jdk7/ws/.gradle/2.13/taskArtifacts/fileHashes.bin'.>
	at org.gradle.cache.internal.btree.FileBackedBlockStore$BlockImpl.blockCorruptedException(FileBackedBlockStore.java:247)
	at org.gradle.cache.internal.btree.FileBackedBlockStore$BlockImpl.read(FileBackedBlockStore.java:223)
	at org.gradle.cache.internal.btree.FileBackedBlockStore.read(FileBackedBlockStore.java:98)
	at org.gradle.cache.internal.btree.CachingBlockStore.read(CachingBlockStore.java:84)
	at org.gradle.cache.internal.btree.FreeListBlockStore.read(FreeListBlockStore.java:78)
	at org.gradle.cache.internal.btree.FreeListBlockStore$FreeListBlock.getNextBlock(FreeListBlockStore.java:204)
	at org.gradle.cache.internal.btree.FreeListBlockStore$FreeListBlock.alloc(FreeListBlockStore.java:221)
	at org.gradle.cache.internal.btree.FreeListBlockStore.attach(FreeListBlockStore.java:88)
	at org.gradle.cache.internal.btree.FreeListBlockStore.write(FreeListBlockStore.java:82)
	at org.gradle.cache.internal.btree.StateCheckBlockStore.write(StateCheckBlockStore.java:66)
	at org.gradle.cache.internal.btree.BTreePersistentIndexedCache.put(BTreePersistentIndexedCache.java:150)
	... 135 more


BUILD FAILED

Total time: 21.784 secs
Build step 'Execute shell' marked build as failure
Recording test results
Setting GRADLE_2_4_RC_2_HOME=/home/jenkins/jenkins-slave/tools/hudson.plugins.gradle.GradleInstallation/Gradle_2.4-rc-2
Setting JDK_1_7U51_HOME=/home/jenkins/jenkins-slave/tools/hudson.model.JDK/jdk-1.7u51
Setting GRADLE_2_4_RC_2_HOME=/home/jenkins/jenkins-slave/tools/hudson.plugins.gradle.GradleInstallation/Gradle_2.4-rc-2
Setting JDK_1_7U51_HOME=/home/jenkins/jenkins-slave/tools/hudson.model.JDK/jdk-1.7u51

Mime
View raw message