kafka-dev mailing list archives

Site index · List index
Message view « Date » · « Thread »
Top « Date » · « Thread »
From Apache Jenkins Server <jenk...@builds.apache.org>
Subject Build failed in Jenkins: kafka-trunk-jdk7 #1255
Date Fri, 06 May 2016 01:04:20 GMT
See <https://builds.apache.org/job/kafka-trunk-jdk7/1255/changes>

Changes:

[ismael] KAFKA-3661; fix NPE in o.a.k.c.c.RoundRobinAssignor when topic metadata

[ismael] KAFKA-3651; Remove the condition variable waiting on memory availability

------------------------------------------
[...truncated 6254 lines...]
org.apache.kafka.connect.runtime.WorkerSinkTaskTest > testPause PASSED

org.apache.kafka.connect.runtime.WorkerSinkTaskTest > testPollRedelivery PASSED

org.apache.kafka.connect.runtime.WorkerSinkTaskTest > testErrorInRebalancePartitionRevocation
PASSED

org.apache.kafka.connect.runtime.WorkerSinkTaskTest > testErrorInRebalancePartitionAssignment
PASSED

org.apache.kafka.connect.runtime.WorkerSourceTaskTest > testPollsInBackground PASSED

org.apache.kafka.connect.runtime.WorkerSourceTaskTest > testCommit PASSED

org.apache.kafka.connect.runtime.WorkerSourceTaskTest > testCommitFailure PASSED

org.apache.kafka.connect.runtime.WorkerSourceTaskTest > testSendRecordsConvertsData PASSED

org.apache.kafka.connect.runtime.WorkerSourceTaskTest > testSendRecordsRetries PASSED

org.apache.kafka.connect.runtime.WorkerSourceTaskTest > testSlowTaskStart PASSED

org.apache.kafka.connect.runtime.WorkerSourceTaskTest > testFailureInPoll PASSED

org.apache.kafka.connect.runtime.WorkerSourceTaskTest > testStartPaused PASSED

org.apache.kafka.connect.runtime.WorkerSourceTaskTest > testPause PASSED

org.apache.kafka.connect.runtime.distributed.DistributedHerderTest > testPutConnectorConfig
PASSED

org.apache.kafka.connect.runtime.distributed.DistributedHerderTest > testJoinAssignment
PASSED

org.apache.kafka.connect.runtime.distributed.DistributedHerderTest > testRebalance PASSED

org.apache.kafka.connect.runtime.distributed.DistributedHerderTest > testRebalanceFailedConnector
PASSED

org.apache.kafka.connect.runtime.distributed.DistributedHerderTest > testHaltCleansUpWorker
PASSED

org.apache.kafka.connect.runtime.distributed.DistributedHerderTest > testCreateConnector
PASSED

org.apache.kafka.connect.runtime.distributed.DistributedHerderTest > testCreateConnectorAlreadyExists
PASSED

org.apache.kafka.connect.runtime.distributed.DistributedHerderTest > testDestroyConnector
PASSED

org.apache.kafka.connect.runtime.distributed.DistributedHerderTest > testRestartConnector
PASSED

org.apache.kafka.connect.runtime.distributed.DistributedHerderTest > testRestartUnknownConnector
PASSED

org.apache.kafka.connect.runtime.distributed.DistributedHerderTest > testRestartConnectorRedirectToLeader
PASSED

org.apache.kafka.connect.runtime.distributed.DistributedHerderTest > testRestartConnectorRedirectToOwner
PASSED

org.apache.kafka.connect.runtime.distributed.DistributedHerderTest > testRestartTask PASSED

org.apache.kafka.connect.runtime.distributed.DistributedHerderTest > testRestartUnknownTask
PASSED

org.apache.kafka.connect.runtime.distributed.DistributedHerderTest > testRestartTaskRedirectToLeader
PASSED

org.apache.kafka.connect.runtime.distributed.DistributedHerderTest > testRestartTaskRedirectToOwner
PASSED

org.apache.kafka.connect.runtime.distributed.DistributedHerderTest > testConnectorConfigAdded
PASSED

org.apache.kafka.connect.runtime.distributed.DistributedHerderTest > testConnectorConfigUpdate
PASSED

org.apache.kafka.connect.runtime.distributed.DistributedHerderTest > testTaskConfigAdded
PASSED

org.apache.kafka.connect.runtime.distributed.DistributedHerderTest > testJoinLeaderCatchUpFails
PASSED

org.apache.kafka.connect.runtime.distributed.DistributedHerderTest > testAccessors PASSED

org.apache.kafka.connect.runtime.distributed.DistributedHerderTest > testInconsistentConfigs
PASSED

org.apache.kafka.connect.runtime.distributed.WorkerCoordinatorTest > testNormalJoinGroupFollower
PASSED

org.apache.kafka.connect.runtime.distributed.WorkerCoordinatorTest > testMetadata PASSED

org.apache.kafka.connect.runtime.distributed.WorkerCoordinatorTest > testLeaderPerformAssignment1
PASSED

org.apache.kafka.connect.runtime.distributed.WorkerCoordinatorTest > testLeaderPerformAssignment2
PASSED

org.apache.kafka.connect.runtime.distributed.WorkerCoordinatorTest > testJoinLeaderCannotAssign
PASSED

org.apache.kafka.connect.runtime.distributed.WorkerCoordinatorTest > testRejoinGroup PASSED

org.apache.kafka.connect.runtime.distributed.WorkerCoordinatorTest > testNormalJoinGroupLeader
PASSED

org.apache.kafka.connect.runtime.standalone.StandaloneHerderTest > testPutConnectorConfig
PASSED

org.apache.kafka.connect.runtime.standalone.StandaloneHerderTest > testPutTaskConfigs PASSED

org.apache.kafka.connect.runtime.standalone.StandaloneHerderTest > testCreateConnectorAlreadyExists
PASSED

org.apache.kafka.connect.runtime.standalone.StandaloneHerderTest > testDestroyConnector
PASSED

org.apache.kafka.connect.runtime.standalone.StandaloneHerderTest > testRestartConnector
PASSED

org.apache.kafka.connect.runtime.standalone.StandaloneHerderTest > testRestartTask PASSED

org.apache.kafka.connect.runtime.standalone.StandaloneHerderTest > testAccessors PASSED

org.apache.kafka.connect.runtime.standalone.StandaloneHerderTest > testCreateSourceConnector
PASSED

org.apache.kafka.connect.runtime.standalone.StandaloneHerderTest > testCreateSinkConnector
PASSED

org.apache.kafka.connect.runtime.standalone.StandaloneHerderTest > testRestartConnectorFailureOnStop
PASSED

org.apache.kafka.connect.runtime.standalone.StandaloneHerderTest > testRestartConnectorFailureOnStart
PASSED

org.apache.kafka.connect.runtime.standalone.StandaloneHerderTest > testRestartTaskFailureOnStop
PASSED

org.apache.kafka.connect.runtime.standalone.StandaloneHerderTest > testRestartTaskFailureOnStart
PASSED

org.apache.kafka.connect.runtime.standalone.StandaloneHerderTest > testCreateAndStop PASSED

org.apache.kafka.connect.runtime.WorkerTest > testAddConnectorByAlias PASSED

org.apache.kafka.connect.runtime.WorkerTest > testAddConnectorByShortAlias PASSED

org.apache.kafka.connect.runtime.WorkerTest > testStopInvalidConnector PASSED

org.apache.kafka.connect.runtime.WorkerTest > testReconfigureConnectorTasks PASSED

org.apache.kafka.connect.runtime.WorkerTest > testAddRemoveTask PASSED

org.apache.kafka.connect.runtime.WorkerTest > testStopInvalidTask PASSED

org.apache.kafka.connect.runtime.WorkerTest > testCleanupTasksOnStop FAILED
    java.lang.AssertionError: 
      Expectation failure on verify:
        WorkerSourceTask.run(): expected: 1, actual: 1
        at org.easymock.internal.MocksControl.verify(MocksControl.java:225)
        at org.powermock.api.easymock.internal.invocationcontrol.EasyMockMethodInvocationControl.verify(EasyMockMethodInvocationControl.java:132)
        at org.powermock.api.easymock.PowerMock.verify(PowerMock.java:1466)
        at org.powermock.api.easymock.PowerMock.verifyAll(PowerMock.java:1405)
        at org.apache.kafka.connect.runtime.WorkerTest.testCleanupTasksOnStop(WorkerTest.java:455)

org.apache.kafka.connect.runtime.WorkerTest > testStartAndStopConnector PASSED

org.apache.kafka.connect.runtime.WorkerConnectorTest > testStartupFailure PASSED

org.apache.kafka.connect.runtime.WorkerConnectorTest > testOnResume PASSED

org.apache.kafka.connect.runtime.WorkerConnectorTest > testStartupPaused PASSED

org.apache.kafka.connect.runtime.WorkerConnectorTest > testTransitionPausedToPaused PASSED

org.apache.kafka.connect.runtime.WorkerConnectorTest > testFailureIsFinalState PASSED

org.apache.kafka.connect.runtime.WorkerConnectorTest > testInitializeFailure PASSED

org.apache.kafka.connect.runtime.WorkerConnectorTest > testStartupAndPause PASSED

org.apache.kafka.connect.runtime.WorkerConnectorTest > testStartupAndShutdown PASSED

org.apache.kafka.connect.runtime.WorkerConnectorTest > testTransitionStartedToStarted PASSED

org.apache.kafka.connect.runtime.WorkerConnectorTest > testShutdownFailure PASSED

org.apache.kafka.connect.runtime.rest.RestServerTest > testCORSEnabled PASSED

org.apache.kafka.connect.runtime.rest.RestServerTest > testCORSDisabled PASSED

org.apache.kafka.connect.runtime.rest.resources.ConnectorPluginsResourceTest > testValidateConfig
PASSED

org.apache.kafka.connect.runtime.rest.resources.ConnectorPluginsResourceTest > testListConnectorPlugins
PASSED

org.apache.kafka.connect.runtime.rest.resources.ConnectorsResourceTest > testPutConnectorConfig
PASSED

org.apache.kafka.connect.runtime.rest.resources.ConnectorsResourceTest > testPutConnectorConfigNameMismatch
PASSED

org.apache.kafka.connect.runtime.rest.resources.ConnectorsResourceTest > testDeleteConnectorNotFound
PASSED

org.apache.kafka.connect.runtime.rest.resources.ConnectorsResourceTest > testGetConnectorTaskConfigsConnectorNotFound
PASSED

org.apache.kafka.connect.runtime.rest.resources.ConnectorsResourceTest > testPutConnectorTaskConfigs
PASSED

org.apache.kafka.connect.runtime.rest.resources.ConnectorsResourceTest > testCreateConnector
PASSED

org.apache.kafka.connect.runtime.rest.resources.ConnectorsResourceTest > testListConnectorsNotLeader
PASSED

org.apache.kafka.connect.runtime.rest.resources.ConnectorsResourceTest > testRestartTaskNotFound
PASSED

org.apache.kafka.connect.runtime.rest.resources.ConnectorsResourceTest > testRestartConnectorNotFound
PASSED

org.apache.kafka.connect.runtime.rest.resources.ConnectorsResourceTest > testRestartTaskLeaderRedirect
PASSED

org.apache.kafka.connect.runtime.rest.resources.ConnectorsResourceTest > testRestartConnectorOwnerRedirect
PASSED

org.apache.kafka.connect.runtime.rest.resources.ConnectorsResourceTest > testPutConnectorTaskConfigsConnectorNotFound
PASSED

org.apache.kafka.connect.runtime.rest.resources.ConnectorsResourceTest > testDeleteConnectorNotLeader
PASSED

org.apache.kafka.connect.runtime.rest.resources.ConnectorsResourceTest > testGetConnectorConfigConnectorNotFound
PASSED

org.apache.kafka.connect.runtime.rest.resources.ConnectorsResourceTest > testDeleteConnector
PASSED

org.apache.kafka.connect.runtime.rest.resources.ConnectorsResourceTest > testGetConnector
PASSED

org.apache.kafka.connect.runtime.rest.resources.ConnectorsResourceTest > testListConnectorsNotSynced
PASSED

org.apache.kafka.connect.runtime.rest.resources.ConnectorsResourceTest > testRestartTaskOwnerRedirect
PASSED

org.apache.kafka.connect.runtime.rest.resources.ConnectorsResourceTest > testListConnectors
PASSED

org.apache.kafka.connect.runtime.rest.resources.ConnectorsResourceTest > testGetConnectorConfig
PASSED

org.apache.kafka.connect.runtime.rest.resources.ConnectorsResourceTest > testGetConnectorTaskConfigs
PASSED

org.apache.kafka.connect.runtime.rest.resources.ConnectorsResourceTest > testCreateConnectorExists
PASSED

org.apache.kafka.connect.runtime.rest.resources.ConnectorsResourceTest > testRestartConnectorLeaderRedirect
PASSED

org.apache.kafka.connect.runtime.rest.resources.ConnectorsResourceTest > testCreateConnectorNotLeader
PASSED

org.apache.kafka.connect.runtime.WorkerSinkTaskThreadedTest > testPollsInBackground PASSED

org.apache.kafka.connect.runtime.WorkerSinkTaskThreadedTest > testCommit PASSED

org.apache.kafka.connect.runtime.WorkerSinkTaskThreadedTest > testRewind PASSED

org.apache.kafka.connect.runtime.WorkerSinkTaskThreadedTest > testAssignmentPauseResume
PASSED

org.apache.kafka.connect.runtime.WorkerSinkTaskThreadedTest > testCommitTaskSuccessAndFlushFailure
PASSED

org.apache.kafka.connect.runtime.WorkerSinkTaskThreadedTest > testCommitTaskFlushFailure
PASSED

org.apache.kafka.connect.runtime.WorkerSinkTaskThreadedTest > testCommitConsumerFailure
PASSED

org.apache.kafka.connect.runtime.WorkerSinkTaskThreadedTest > testCommitTimeout PASSED

158 tests completed, 1 failed
:connect:runtime:test FAILED

FAILURE: Build failed with an exception.

* What went wrong:
Execution failed for task ':connect:runtime:test'.
> There were failing tests. See the report at: file://<https://builds.apache.org/job/kafka-trunk-jdk7/ws/connect/runtime/build/reports/tests/index.html>

* Try:
Run with --stacktrace option to get the stack trace. Run with --info or --debug option to
get more log output.

BUILD FAILED

Total time: 1 hrs 58 mins 14.609 secs
Build step 'Execute shell' marked build as failure
Recording test results
Setting GRADLE_2_4_RC_2_HOME=/home/jenkins/jenkins-slave/tools/hudson.plugins.gradle.GradleInstallation/Gradle_2.4-rc-2
Setting JDK_1_7U51_HOME=/home/jenkins/jenkins-slave/tools/hudson.model.JDK/jdk-1.7u51
Setting GRADLE_2_4_RC_2_HOME=/home/jenkins/jenkins-slave/tools/hudson.plugins.gradle.GradleInstallation/Gradle_2.4-rc-2
Setting JDK_1_7U51_HOME=/home/jenkins/jenkins-slave/tools/hudson.model.JDK/jdk-1.7u51

Mime
View raw message