kafka-dev mailing list archives

Site index · List index
Message view « Date » · « Thread »
Top « Date » · « Thread »
From Apache Jenkins Server <jenk...@builds.apache.org>
Subject Build failed in Jenkins: kafka-trunk-jdk7 #1216
Date Mon, 25 Apr 2016 21:53:12 GMT
See <https://builds.apache.org/job/kafka-trunk-jdk7/1216/changes>

Changes:

[wangguoz] KAFKA-3619: File handles are leaked on .lock files of

------------------------------------------
[...truncated 454 lines...]
kafka.log.BrokerCompressionTest > testBrokerSideCompression[19] PASSED

kafka.log.OffsetIndexTest > lookupExtremeCases PASSED

kafka.log.OffsetIndexTest > appendTooMany PASSED

kafka.log.OffsetIndexTest > randomLookupTest PASSED

kafka.log.OffsetIndexTest > testReopen PASSED

kafka.log.OffsetIndexTest > appendOutOfOrder PASSED

kafka.log.OffsetIndexTest > truncate PASSED

kafka.log.OffsetMapTest > testClear PASSED

kafka.log.OffsetMapTest > testBasicValidation PASSED

kafka.log.LogManagerTest > testCleanupSegmentsToMaintainSize PASSED

kafka.log.LogManagerTest > testRecoveryDirectoryMappingWithRelativeDirectory PASSED

kafka.log.LogManagerTest > testGetNonExistentLog PASSED

kafka.log.LogManagerTest > testTwoLogManagersUsingSameDirFails PASSED

kafka.log.LogManagerTest > testLeastLoadedAssignment PASSED

kafka.log.LogManagerTest > testCleanupExpiredSegments PASSED

kafka.log.LogManagerTest > testCheckpointRecoveryPoints PASSED

kafka.log.LogManagerTest > testTimeBasedFlush PASSED

kafka.log.LogManagerTest > testCreateLog PASSED

kafka.log.LogManagerTest > testRecoveryDirectoryMappingWithTrailingSlash PASSED

kafka.log.CleanerTest > testBuildOffsetMap PASSED

kafka.log.CleanerTest > testSegmentGrouping PASSED

kafka.log.CleanerTest > testCleanSegmentsWithAbort PASSED

kafka.log.CleanerTest > testSegmentGroupingWithSparseOffsets PASSED

kafka.log.CleanerTest > testRecoveryAfterCrash PASSED

kafka.log.CleanerTest > testLogToClean PASSED

kafka.log.CleanerTest > testCleaningWithDeletes PASSED

kafka.log.CleanerTest > testCleanSegments PASSED

kafka.log.CleanerTest > testCleaningWithUnkeyedMessages PASSED

kafka.log.LogConfigTest > testFromPropsEmpty PASSED

kafka.log.LogConfigTest > testKafkaConfigToProps PASSED

kafka.log.LogConfigTest > testFromPropsInvalid PASSED

kafka.log.LogCleanerIntegrationTest > cleanerTest[0] PASSED

kafka.log.LogCleanerIntegrationTest > cleanerTest[1] PASSED

kafka.log.LogCleanerIntegrationTest > cleanerTest[2] PASSED

kafka.log.LogCleanerIntegrationTest > cleanerTest[3] PASSED

kafka.log.FileMessageSetTest > testTruncate PASSED

kafka.log.FileMessageSetTest > testIterationOverPartialAndTruncation PASSED

kafka.log.FileMessageSetTest > testRead PASSED

kafka.log.FileMessageSetTest > testFileSize PASSED

kafka.log.FileMessageSetTest > testIteratorWithLimits PASSED

kafka.log.FileMessageSetTest > testPreallocateTrue PASSED

kafka.log.FileMessageSetTest > testIteratorIsConsistent PASSED

kafka.log.FileMessageSetTest > testFormatConversionWithPartialMessage PASSED

kafka.log.FileMessageSetTest > testIterationDoesntChangePosition PASSED

kafka.log.FileMessageSetTest > testWrittenEqualsRead PASSED

kafka.log.FileMessageSetTest > testWriteTo PASSED

kafka.log.FileMessageSetTest > testPreallocateFalse PASSED

kafka.log.FileMessageSetTest > testPreallocateClearShutdown PASSED

kafka.log.FileMessageSetTest > testMessageFormatConversion PASSED

kafka.log.FileMessageSetTest > testSearch PASSED

kafka.log.FileMessageSetTest > testSizeInBytes PASSED

kafka.log.LogSegmentTest > testRecoveryWithCorruptMessage PASSED

kafka.log.LogSegmentTest > testRecoveryFixesCorruptIndex PASSED

kafka.log.LogSegmentTest > testReadFromGap PASSED

kafka.log.LogSegmentTest > testTruncate PASSED

kafka.log.LogSegmentTest > testReadBeforeFirstOffset PASSED

kafka.log.LogSegmentTest > testCreateWithInitFileSizeAppendMessage PASSED

kafka.log.LogSegmentTest > testChangeFileSuffixes PASSED

kafka.log.LogSegmentTest > testMaxOffset PASSED

kafka.log.LogSegmentTest > testNextOffsetCalculation PASSED

kafka.log.LogSegmentTest > testReadOnEmptySegment PASSED

kafka.log.LogSegmentTest > testReadAfterLast PASSED

kafka.log.LogSegmentTest > testCreateWithInitFileSizeClearShutdown PASSED

kafka.log.LogSegmentTest > testTruncateFull PASSED

kafka.log.LogTest > testParseTopicPartitionNameForMissingTopic PASSED

kafka.log.LogTest > testIndexRebuild PASSED

kafka.log.LogTest > testLogRolls PASSED

kafka.log.LogTest > testMessageSizeCheck PASSED

kafka.log.LogTest > testAsyncDelete PASSED

kafka.log.LogTest > testReadOutOfRange PASSED

kafka.log.LogTest > testAppendWithOutOfOrderOffsetsThrowsException PASSED

kafka.log.LogTest > testReadAtLogGap PASSED

kafka.log.LogTest > testTimeBasedLogRoll PASSED

kafka.log.LogTest > testLoadEmptyLog PASSED

kafka.log.LogTest > testMessageSetSizeCheck PASSED

kafka.log.LogTest > testIndexResizingAtTruncation PASSED

kafka.log.LogTest > testCompactedTopicConstraints PASSED

kafka.log.LogTest > testThatGarbageCollectingSegmentsDoesntChangeOffset PASSED

kafka.log.LogTest > testAppendAndReadWithSequentialOffsets PASSED

kafka.log.LogTest > testParseTopicPartitionNameForNull PASSED

kafka.log.LogTest > testAppendAndReadWithNonSequentialOffsets PASSED

kafka.log.LogTest > testParseTopicPartitionNameForMissingSeparator PASSED

kafka.log.LogTest > testCorruptIndexRebuild PASSED

kafka.log.LogTest > testBogusIndexSegmentsAreRemoved PASSED

kafka.log.LogTest > testCompressedMessages PASSED

kafka.log.LogTest > testAppendMessageWithNullPayload PASSED

kafka.log.LogTest > testCorruptLog PASSED

kafka.log.LogTest > testLogRecoversToCorrectOffset PASSED

kafka.log.LogTest > testReopenThenTruncate PASSED

kafka.log.LogTest > testParseTopicPartitionNameForMissingPartition PASSED

kafka.log.LogTest > testParseTopicPartitionNameForEmptyName PASSED

kafka.log.LogTest > testOpenDeletesObsoleteFiles PASSED

kafka.log.LogTest > testSizeBasedLogRoll PASSED

kafka.log.LogTest > testTimeBasedLogRollJitter PASSED

kafka.log.LogTest > testParseTopicPartitionName PASSED

kafka.log.LogTest > testTruncateTo PASSED

kafka.log.LogTest > testCleanShutdownFile PASSED

kafka.javaapi.message.ByteBufferMessageSetTest > testSizeInBytesWithCompression PASSED

kafka.javaapi.message.ByteBufferMessageSetTest > testIteratorIsConsistentWithCompression
PASSED

kafka.javaapi.message.ByteBufferMessageSetTest > testIteratorIsConsistent PASSED

kafka.javaapi.message.ByteBufferMessageSetTest > testEqualsWithCompression PASSED

kafka.javaapi.message.ByteBufferMessageSetTest > testWrittenEqualsRead PASSED

kafka.javaapi.message.ByteBufferMessageSetTest > testEquals PASSED

kafka.javaapi.message.ByteBufferMessageSetTest > testSizeInBytes PASSED

kafka.javaapi.consumer.ZookeeperConsumerConnectorTest > testBasic PASSED

kafka.metrics.KafkaTimerTest > testKafkaTimer PASSED

kafka.server.DynamicConfigChangeTest > testProcessNotification PASSED

kafka.server.DynamicConfigChangeTest > testClientQuotaConfigChange PASSED

kafka.server.DynamicConfigChangeTest > testConfigChangeOnNonExistingTopic PASSED

kafka.server.DynamicConfigChangeTest > testConfigChange PASSED

kafka.server.SslReplicaFetchTest > testReplicaFetcherThread PASSED
Java HotSpot(TM) 64-Bit Server VM warning: INFO: os::commit_memory(0x00000007dc900000, 389545984,
0) failed; error='Cannot allocate memory' (errno=12)
#
# There is insufficient memory for the Java Runtime Environment to continue.
# Native memory allocation (malloc) failed to allocate 389545984 bytes for committing reserved
memory.
# An error report file with more information is saved as:
# <https://builds.apache.org/job/kafka-trunk-jdk7/ws/core/hs_err_pid6082.log>
:kafka-trunk-jdk7:core:test FAILED
:test_core_2_10 FAILED

FAILURE: Build failed with an exception.

* What went wrong:
Execution failed for task ':core:test'.
> Process 'Gradle Test Executor 2' finished with non-zero exit value 1

* Try:
Run with --stacktrace option to get the stack trace. Run with --info or --debug option to
get more log output.

BUILD FAILED

Total time: 8 mins 57.251 secs
Build step 'Execute shell' marked build as failure
Recording test results
Setting GRADLE_2_4_RC_2_HOME=/home/jenkins/jenkins-slave/tools/hudson.plugins.gradle.GradleInstallation/Gradle_2.4-rc-2
Setting JDK_1_7U51_HOME=/home/jenkins/jenkins-slave/tools/hudson.model.JDK/jdk-1.7u51
ERROR: Step ‘Publish JUnit test result report’ failed: No test report files were found.
Configuration error?
Setting GRADLE_2_4_RC_2_HOME=/home/jenkins/jenkins-slave/tools/hudson.plugins.gradle.GradleInstallation/Gradle_2.4-rc-2
Setting JDK_1_7U51_HOME=/home/jenkins/jenkins-slave/tools/hudson.model.JDK/jdk-1.7u51

Mime
View raw message