kafka-dev mailing list archives

Site index · List index
Message view « Date » · « Thread »
Top « Date » · « Thread »
From Apache Jenkins Server <jenk...@builds.apache.org>
Subject Build failed in Jenkins: kafka-trunk-jdk7 #1176
Date Tue, 05 Apr 2016 05:34:09 GMT
See <https://builds.apache.org/job/kafka-trunk-jdk7/1176/changes>

Changes:

[wangguoz] KAFKA-2998: log warnings when client is disconnected from bootstrap

------------------------------------------
[...truncated 1561 lines...]
kafka.api.PlaintextConsumerTest > testMultiConsumerSessionTimeoutOnStopPolling PASSED

kafka.api.PlaintextConsumerTest > testPartitionsForInvalidTopic PASSED

kafka.api.PlaintextConsumerTest > testSeek PASSED

kafka.api.PlaintextConsumerTest > testPositionAndCommit PASSED

kafka.api.PlaintextConsumerTest > testMultiConsumerSessionTimeoutOnClose PASSED

kafka.api.PlaintextConsumerTest > testFetchRecordTooLarge PASSED

kafka.api.PlaintextConsumerTest > testMultiConsumerDefaultAssignment FAILED
    java.lang.AssertionError: Did not get valid assignment for partitions [topic1-2, topic2-0,
topic1-4, topic-1, topic-0, topic2-1, topic1-0, topic1-3, topic1-1, topic2-2] after we changed
subscription
        at org.junit.Assert.fail(Assert.java:88)
        at kafka.utils.TestUtils$.waitUntilTrue(TestUtils.scala:765)
        at kafka.api.PlaintextConsumerTest.validateGroupAssignment(PlaintextConsumerTest.scala:910)
        at kafka.api.PlaintextConsumerTest.changeConsumerGroupSubscriptionAndValidateAssignment(PlaintextConsumerTest.scala:929)
        at kafka.api.PlaintextConsumerTest.testMultiConsumerDefaultAssignment(PlaintextConsumerTest.scala:546)

    java.util.ConcurrentModificationException: KafkaConsumer is not safe for multi-threaded
access

kafka.api.PlaintextConsumerTest > testAutoCommitOnClose PASSED

kafka.api.PlaintextConsumerTest > testExpandingTopicSubscriptions PASSED

kafka.api.PlaintextConsumerTest > testInterceptors PASSED

kafka.api.PlaintextConsumerTest > testPatternUnsubscription PASSED

kafka.api.PlaintextConsumerTest > testGroupConsumption PASSED

kafka.api.PlaintextConsumerTest > testPartitionsFor PASSED

kafka.api.PlaintextConsumerTest > testInterceptorsWithWrongKeyValue PASSED

kafka.api.PlaintextConsumerTest > testMultiConsumerRoundRobinAssignment PASSED

kafka.api.PlaintextConsumerTest > testPartitionPauseAndResume PASSED

kafka.api.PlaintextConsumerTest > testConsumeMessagesWithLogAppendTime PASSED

kafka.api.PlaintextConsumerTest > testAutoCommitOnCloseAfterWakeup PASSED

kafka.api.PlaintextConsumerTest > testMaxPollRecords PASSED

kafka.api.PlaintextConsumerTest > testAutoOffsetReset PASSED

kafka.api.PlaintextConsumerTest > testFetchInvalidOffset PASSED

kafka.api.PlaintextConsumerTest > testAutoCommitIntercept PASSED

kafka.api.PlaintextConsumerTest > testCommitMetadata PASSED

kafka.api.PlaintextConsumerTest > testRoundRobinAssignment PASSED

kafka.api.PlaintextConsumerTest > testPatternSubscription PASSED

kafka.api.PlaintextConsumerTest > testPauseStateNotPreservedByRebalance PASSED

kafka.api.PlaintextConsumerTest > testUnsubscribeTopic PASSED

kafka.api.PlaintextConsumerTest > testListTopics PASSED

kafka.api.PlaintextConsumerTest > testAutoCommitOnRebalance PASSED

kafka.api.PlaintextConsumerTest > testSimpleConsumption FAILED
    java.lang.AssertionError: expected:<1> but was:<0>

kafka.api.PlaintextConsumerTest > testPartitionReassignmentCallback PASSED

kafka.api.PlaintextConsumerTest > testCommitSpecifiedOffsets PASSED

kafka.api.ProducerBounceTest > testBrokerFailure PASSED

kafka.api.ProducerFailureHandlingTest > testCannotSendToInternalTopic PASSED

kafka.api.ProducerFailureHandlingTest > testTooLargeRecordWithAckOne PASSED

kafka.api.ProducerFailureHandlingTest > testWrongBrokerList PASSED

kafka.api.ProducerFailureHandlingTest > testNotEnoughReplicas PASSED

kafka.api.ProducerFailureHandlingTest > testNonExistentTopic PASSED

kafka.api.ProducerFailureHandlingTest > testInvalidPartition PASSED

kafka.api.ProducerFailureHandlingTest > testSendAfterClosed PASSED

kafka.api.ProducerFailureHandlingTest > testTooLargeRecordWithAckZero PASSED

kafka.api.ProducerFailureHandlingTest > testNotEnoughReplicasAfterBrokerShutdown PASSED

kafka.api.RackAwareAutoTopicCreationTest > testAutoCreateTopic PASSED

kafka.api.SaslPlaintextConsumerTest > testPauseStateNotPreservedByRebalance PASSED

kafka.api.SaslPlaintextConsumerTest > testUnsubscribeTopic PASSED

kafka.api.SaslPlaintextConsumerTest > testListTopics PASSED

kafka.api.SaslPlaintextConsumerTest > testAutoCommitOnRebalance PASSED

kafka.api.SaslPlaintextConsumerTest > testSimpleConsumption PASSED

kafka.api.SaslPlaintextConsumerTest > testPartitionReassignmentCallback PASSED

kafka.api.SaslPlaintextConsumerTest > testCommitSpecifiedOffsets PASSED

kafka.api.SslConsumerTest > testPauseStateNotPreservedByRebalance PASSED

kafka.api.SslConsumerTest > testUnsubscribeTopic PASSED

kafka.api.SslConsumerTest > testListTopics PASSED

kafka.api.SslConsumerTest > testAutoCommitOnRebalance PASSED

kafka.api.SslConsumerTest > testSimpleConsumption FAILED
    java.lang.AssertionError: expected:<1> but was:<0>

kafka.api.SslConsumerTest > testPartitionReassignmentCallback PASSED

kafka.api.SslConsumerTest > testCommitSpecifiedOffsets PASSED

kafka.api.ConsumerBounceTest > testSeekAndCommitWithBrokerFailures PASSED

kafka.api.ConsumerBounceTest > testConsumptionWithBrokerFailures PASSED

kafka.api.AuthorizerIntegrationTest > testCommitWithTopicWrite PASSED

kafka.api.AuthorizerIntegrationTest > testConsumeWithNoTopicAccess PASSED

kafka.api.AuthorizerIntegrationTest > testCreatePermissionNeededToReadFromNonExistentTopic
PASSED

kafka.api.AuthorizerIntegrationTest > testOffsetFetchWithNoAccess PASSED

kafka.api.AuthorizerIntegrationTest > testListOfsetsWithTopicDescribe PASSED

kafka.api.AuthorizerIntegrationTest > testProduceWithTopicRead PASSED

kafka.api.AuthorizerIntegrationTest > testListOffsetsWithNoTopicAccess PASSED

kafka.api.AuthorizerIntegrationTest > testCreatePermissionNeededForWritingToNonExistentTopic
PASSED

kafka.api.AuthorizerIntegrationTest > testConsumeWithNoGroupAccess PASSED

kafka.api.AuthorizerIntegrationTest > testConsumeWithTopicDescribe PASSED

kafka.api.AuthorizerIntegrationTest > testOffsetFetchWithNoTopicAccess PASSED

kafka.api.AuthorizerIntegrationTest > testCommitWithNoTopicAccess PASSED

kafka.api.AuthorizerIntegrationTest > testProduceWithNoTopicAccess PASSED

kafka.api.AuthorizerIntegrationTest > testProduceWithTopicWrite PASSED

kafka.api.AuthorizerIntegrationTest > testAuthorization PASSED

kafka.api.AuthorizerIntegrationTest > testConsumeWithTopicAndGroupRead PASSED

kafka.api.AuthorizerIntegrationTest > testConsumeWithTopicWrite PASSED

kafka.api.AuthorizerIntegrationTest > testOffsetFetchWithNoGroupAccess PASSED

kafka.api.AuthorizerIntegrationTest > testCommitWithNoAccess PASSED

kafka.api.AuthorizerIntegrationTest > testCommitWithNoGroupAccess PASSED

kafka.api.AuthorizerIntegrationTest > testConsumeWithNoAccess PASSED

kafka.api.AuthorizerIntegrationTest > testOffsetFetchWithTopicAndGroupRead PASSED

kafka.api.AuthorizerIntegrationTest > testCommitWithTopicDescribe PASSED

kafka.api.AuthorizerIntegrationTest > testProduceWithTopicDescribe PASSED

kafka.api.AuthorizerIntegrationTest > testOffsetFetchTopicDescribe PASSED

kafka.api.AuthorizerIntegrationTest > testCommitWithTopicAndGroupRead PASSED

kafka.api.RequestResponseSerializationTest > testSerializationAndDeserialization PASSED

kafka.api.RequestResponseSerializationTest > testFetchResponseVersion PASSED

kafka.api.RequestResponseSerializationTest > testProduceResponseVersion PASSED

kafka.api.SaslSslConsumerTest > testPauseStateNotPreservedByRebalance PASSED

kafka.api.SaslSslConsumerTest > testUnsubscribeTopic PASSED

kafka.api.SaslSslConsumerTest > testListTopics PASSED

kafka.api.SaslSslConsumerTest > testAutoCommitOnRebalance PASSED

kafka.api.SaslSslConsumerTest > testSimpleConsumption PASSED

kafka.api.SaslSslConsumerTest > testPartitionReassignmentCallback PASSED

kafka.api.SaslSslConsumerTest > testCommitSpecifiedOffsets PASSED

kafka.api.test.ProducerCompressionTest > testCompression[0] PASSED

kafka.api.test.ProducerCompressionTest > testCompression[1] PASSED

kafka.api.test.ProducerCompressionTest > testCompression[2] PASSED

kafka.api.test.ProducerCompressionTest > testCompression[3] PASSED

kafka.controller.ControllerFailoverTest > testMetadataUpdate PASSED

kafka.tools.ConsoleProducerTest > testParseKeyProp PASSED

kafka.tools.ConsoleProducerTest > testValidConfigsOldProducer PASSED

kafka.tools.ConsoleProducerTest > testInvalidConfigs PASSED

kafka.tools.ConsoleProducerTest > testValidConfigsNewProducer PASSED

kafka.tools.ConsoleConsumerTest > shouldLimitReadsToMaxMessageLimit PASSED

kafka.tools.ConsoleConsumerTest > shouldParseValidNewConsumerValidConfig PASSED

kafka.tools.ConsoleConsumerTest > shouldParseConfigsFromFile PASSED

kafka.tools.ConsoleConsumerTest > shouldParseValidOldConsumerValidConfig PASSED

722 tests completed, 3 failed
:kafka-trunk-jdk7:core:test FAILED
:test_core_2_10 FAILED

FAILURE: Build failed with an exception.

* What went wrong:
Execution failed for task ':core:test'.
> Process 'Gradle Test Executor 2' finished with non-zero exit value 1

* Try:
Run with --stacktrace option to get the stack trace. Run with --info or --debug option to
get more log output.

BUILD FAILED

Total time: 55 mins 4.659 secs
Build step 'Execute shell' marked build as failure
Recording test results
Setting GRADLE_2_4_RC_2_HOME=/home/jenkins/jenkins-slave/tools/hudson.plugins.gradle.GradleInstallation/Gradle_2.4-rc-2
Setting JDK_1_7U51_HOME=/home/jenkins/jenkins-slave/tools/hudson.model.JDK/jdk-1.7u51
ERROR: Step ?Publish JUnit test result report? failed: No test report files were found. Configuration
error?
Setting GRADLE_2_4_RC_2_HOME=/home/jenkins/jenkins-slave/tools/hudson.plugins.gradle.GradleInstallation/Gradle_2.4-rc-2
Setting JDK_1_7U51_HOME=/home/jenkins/jenkins-slave/tools/hudson.model.JDK/jdk-1.7u51

Mime
View raw message