kafka-dev mailing list archives

Site index · List index
Message view « Date » · « Thread »
Top « Date » · « Thread »
From Apache Jenkins Server <jenk...@builds.apache.org>
Subject Build failed in Jenkins: kafka-trunk-jdk7 #664
Date Wed, 07 Oct 2015 16:49:05 GMT
See <https://builds.apache.org/job/kafka-trunk-jdk7/664/changes>

Changes:

[junrao] KAFKA-2534: Fixes and unit tests for SSLTransportLayer buffer overflow

------------------------------------------
[...truncated 1450 lines...]
kafka.integration.PlaintextTopicMetadataTest > testAliveBrokersListWithNoTopicsAfterNewBrokerStartup
PASSED

kafka.admin.AdminTest > testManualReplicaAssignment PASSED

kafka.admin.AddPartitionsTest > testIncrementPartitions PASSED

kafka.api.ProducerSendTest > testCloseWithZeroTimeoutFromCallerThread PASSED

kafka.integration.MinIsrConfigTest > testDefaultKafkaConfig PASSED

kafka.admin.DeleteConsumerGroupTest > testGroupTopicWideDeleteInZKForGroupConsumingMultipleTopics
PASSED

kafka.integration.PlaintextTopicMetadataTest > testBasicTopicMetadata PASSED

kafka.integration.SslTopicMetadataTest > testTopicMetadataRequest PASSED

kafka.common.ZkNodeChangeNotificationListenerTest > testProcessNotification PASSED

kafka.api.QuotasTest > testProducerConsumerOverrideUnthrottled PASSED

kafka.integration.PlaintextTopicMetadataTest > testTopicMetadataRequest PASSED

kafka.admin.DeleteTopicTest > testResumeDeleteTopicWithRecoveredFollower PASSED

kafka.api.ConsumerTest > testUnsubscribeTopic PASSED

kafka.api.ConsumerBounceTest > testSeekAndCommitWithBrokerFailures PASSED

kafka.admin.AdminTest > testPartitionReassignmentWithLeaderInNewReplicas PASSED

kafka.admin.DeleteConsumerGroupTest > testGroupWideDeleteInZK PASSED

kafka.admin.AddPartitionsTest > testManualAssignmentOfReplicas PASSED

kafka.integration.SslTopicMetadataTest > testAliveBrokersListWithNoTopicsAfterABrokerShutdown
PASSED

kafka.admin.DeleteTopicTest > testDeleteTopicAlreadyMarkedAsDeleted PASSED

kafka.integration.PlaintextTopicMetadataTest > testAliveBrokersListWithNoTopicsAfterABrokerShutdown
PASSED

kafka.common.ConfigTest > testInvalidGroupIds PASSED

kafka.common.ConfigTest > testInvalidClientIds PASSED

kafka.api.ProducerSendTest > testCloseWithZeroTimeoutFromSenderThread PASSED

kafka.metrics.KafkaTimerTest > testKafkaTimer PASSED

kafka.log.LogCleanerIntegrationTest > cleanerTest[0] PASSED

kafka.admin.AdminTest > testShutdownBroker PASSED

kafka.admin.AdminTest > testTopicCreationWithCollision PASSED

kafka.api.ConsumerTest > testAutoCommitOnClose PASSED

kafka.admin.AdminTest > testTopicCreationInZK PASSED

kafka.controller.ControllerFailoverTest > testMetadataUpdate PASSED

kafka.network.SocketServerTest > testMaxConnectionsPerIp PASSED

kafka.network.SocketServerTest > simpleRequest PASSED

kafka.network.SocketServerTest > testSessionPrincipal PASSED

kafka.network.SocketServerTest > testSocketsCloseOnShutdown PASSED

kafka.network.SocketServerTest > testMaxConnectionsPerIPOverrides PASSED

kafka.admin.AddPartitionsTest > testReplicaPlacement PASSED

kafka.integration.UncleanLeaderElectionTest > testUncleanLeaderElectionEnabled PASSED

kafka.admin.DeleteTopicTest > testPartitionReassignmentDuringDeleteTopic PASSED

kafka.network.SocketServerTest > testSSLSocketServer PASSED

kafka.network.SocketServerTest > tooBigRequestIsRejected PASSED

kafka.api.QuotasTest > testThrottledProducerConsumer PASSED

kafka.integration.FetcherTest > testFetcher PASSED

kafka.zk.ZKEphemeralTest > testZkWatchedEphemeralRecursive PASSED

kafka.utils.ReplicationUtilsTest > testUpdateLeaderAndIsr PASSED

kafka.zk.ZKEphemeralTest > testOverlappingSessions PASSED

kafka.utils.ReplicationUtilsTest > testGetLeaderIsrAndEpochForPartition PASSED

kafka.zk.ZKEphemeralTest > testEphemeralNodeCleanup PASSED

kafka.zk.ZKEphemeralTest > testZkWatchedEphemeral PASSED

kafka.zk.ZKEphemeralTest > testSameSession PASSED

kafka.api.ConsumerTest > testListTopics PASSED

kafka.admin.DeleteTopicTest > testDeleteNonExistingTopic PASSED

kafka.api.ConsumerTest > testExpandingTopicSubscriptions PASSED

kafka.admin.DeleteTopicTest > testRecreateTopicAfterDeletion PASSED

kafka.admin.DeleteTopicTest > testAddPartitionDuringDeleteTopic PASSED

kafka.api.ConsumerTest > testPatternUnsubscription PASSED

kafka.api.ConsumerBounceTest > testConsumptionWithBrokerFailures PASSED

kafka.utils.ByteBoundedBlockingQueueTest > testByteBoundedBlockingQueue PASSED

kafka.log.LogCleanerIntegrationTest > cleanerTest[1] PASSED

kafka.integration.UncleanLeaderElectionTest > testCleanLeaderElectionDisabledByTopicOverride
PASSED

kafka.admin.DeleteTopicTest > testDeleteTopicWithAllAliveReplicas PASSED

kafka.api.ConsumerTest > testGroupConsumption PASSED

kafka.admin.DeleteTopicTest > testDeleteTopicDuringAddPartition PASSED

kafka.api.ConsumerTest > testPartitionsFor PASSED

kafka.api.ConsumerTest > testAutoCommitOnRebalance PASSED

kafka.log.LogCleanerIntegrationTest > cleanerTest[2] PASSED

kafka.integration.UncleanLeaderElectionTest > testUncleanLeaderElectionDisabled PASSED

kafka.integration.RollingBounceTest > testRollingBounce PASSED

kafka.common.TopicTest > testInvalidTopicNames PASSED

kafka.common.TopicTest > testTopicHasCollision PASSED

kafka.common.TopicTest > testTopicHasCollisionChars PASSED

kafka.api.ConsumerTest > testSimpleConsumption PASSED

kafka.integration.UncleanLeaderElectionTest > testUncleanLeaderElectionInvalidTopicOverride
PASSED

kafka.api.ConsumerTest > testPartitionPauseAndResume PASSED

kafka.integration.UncleanLeaderElectionTest > testUncleanLeaderElectionEnabledByTopicOverride
PASSED

kafka.zk.ZKPathTest > testCreatePersistentSequentialThrowsException PASSED

kafka.zk.ZKPathTest > testCreatePersistentSequentialExists PASSED

kafka.zk.ZKPathTest > testCreateEphemeralPathExists PASSED

kafka.zk.ZKPathTest > testCreatePersistentPath PASSED

kafka.zk.ZKPathTest > testMakeSurePersistsPathExistsThrowsException PASSED

kafka.zk.ZKPathTest > testCreateEphemeralPathThrowsException PASSED

kafka.zk.ZKPathTest > testCreatePersistentPathThrowsException PASSED

kafka.zk.ZKPathTest > testMakeSurePersistsPathExists PASSED

kafka.api.ConsumerTest > testPartitionReassignmentCallback PASSED

kafka.log.LogCleanerIntegrationTest > cleanerTest[3] PASSED

kafka.api.ConsumerTest > testAutoOffsetReset PASSED

kafka.log.LogManagerTest > testCleanupExpiredSegments PASSED

kafka.log.LogManagerTest > testCheckpointRecoveryPoints PASSED

kafka.log.LogManagerTest > testTimeBasedFlush PASSED

kafka.log.LogManagerTest > testCreateLog PASSED

kafka.log.LogManagerTest > testRecoveryDirectoryMappingWithTrailingSlash PASSED

kafka.api.SSLConsumerTest > testSeek PASSED

kafka.api.SSLProducerSendTest > testClose PASSED

kafka.api.ConsumerTest > testCommitSpecifiedOffsets PASSED

kafka.api.SSLProducerSendTest > testSendToPartition PASSED

kafka.api.ConsumerTest > testCommitMetadata PASSED

kafka.api.SSLProducerSendTest > testSendOffset PASSED

kafka.utils.CommandLineUtilsTest > testParseEmptyArg PASSED

kafka.utils.CommandLineUtilsTest > testParseSingleArg PASSED

kafka.utils.CommandLineUtilsTest > testParseArgs PASSED

kafka.api.SSLConsumerTest > testPositionAndCommit PASSED

kafka.api.ConsumerTest > testPatternSubscription PASSED

kafka.utils.SchedulerTest > testMockSchedulerNonPeriodicTask PASSED

kafka.utils.SchedulerTest > testMockSchedulerPeriodicTask PASSED

kafka.utils.SchedulerTest > testNonPeriodicTask PASSED

kafka.utils.SchedulerTest > testRestart PASSED

kafka.utils.SchedulerTest > testReentrantTaskInMockScheduler PASSED

kafka.utils.SchedulerTest > testPeriodicTask PASSED

kafka.api.SSLConsumerTest > testGroupConsumption PASSED

kafka.api.SSLConsumerTest > testPartitionsFor PASSED

kafka.api.SSLConsumerTest > testSimpleConsumption PASSED

kafka.api.SSLConsumerTest > testAutoOffsetReset PASSED

kafka.utils.timer.TimerTest > testAlreadyExpiredTask PASSED

kafka.utils.timer.TimerTest > testTaskExpiration PASSED

492 tests completed, 2 failed
:kafka-trunk-jdk7:core:test FAILED
:test_core_2_10_5 FAILED

FAILURE: Build failed with an exception.

* What went wrong:
Execution failed for task ':core:test'.
> Process 'Gradle Test Executor 9' finished with non-zero exit value 1

* Try:
Run with --stacktrace option to get the stack trace. Run with --info or --debug option to
get more log output.

BUILD FAILED

Total time: 9 mins 39.355 secs
Build step 'Execute shell' marked build as failure
Recording test results
Setting GRADLE_2_1_HOME=/home/jenkins/jenkins-slave/tools/hudson.plugins.gradle.GradleInstallation/Gradle_2.1
Setting JDK_1_7_LATEST__HOME=/home/jenkins/tools/java/latest1.7
ERROR: Publisher 'Publish JUnit test result report' failed: No test report files were found.
Configuration error?
Setting GRADLE_2_1_HOME=/home/jenkins/jenkins-slave/tools/hudson.plugins.gradle.GradleInstallation/Gradle_2.1
Setting JDK_1_7_LATEST__HOME=/home/jenkins/tools/java/latest1.7

Mime
View raw message