kafka-dev mailing list archives

Site index · List index
Message view « Date » · « Thread »
Top « Date » · « Thread »
From Apache Jenkins Server <jenk...@builds.apache.org>
Subject Build failed in Jenkins: kafka-trunk-jdk8 #79
Date Fri, 30 Oct 2015 22:21:38 GMT
See <https://builds.apache.org/job/kafka-trunk-jdk8/79/changes>

Changes:

[cshapi] KAFKA-2714: Added integration tests for exceptional cases in fetching

[cshapi] KAFKA-2369: Add REST API for Copycat.

[cshapi] KAFKA-2715: Removed previous system_test folder

------------------------------------------
[...truncated 233 lines...]
    ControllerStats.uncleanLeaderElectionRate
                    ^
<https://builds.apache.org/job/kafka-trunk-jdk8/ws/core/src/main/scala/kafka/server/KafkaServer.scala>:294:
a pure expression does nothing in statement position; you may be omitting necessary parentheses
    ControllerStats.leaderElectionTimer
                    ^
<https://builds.apache.org/job/kafka-trunk-jdk8/ws/core/src/main/scala/kafka/server/OffsetManager.scala>:380:
value DEFAULT_TIMESTAMP in object OffsetCommitRequest is deprecated: see corresponding Javadoc
for more information.
                        if (value.expireTimestamp == org.apache.kafka.common.requests.OffsetCommitRequest.DEFAULT_TIMESTAMP)
                                                                                         
                ^
<https://builds.apache.org/job/kafka-trunk-jdk8/ws/core/src/main/scala/kafka/tools/ConsoleProducer.scala>:115:
value METADATA_FETCH_TIMEOUT_CONFIG in object ProducerConfig is deprecated: see corresponding
Javadoc for more information.
    props.put(ProducerConfig.METADATA_FETCH_TIMEOUT_CONFIG, config.metadataFetchTimeoutMs.toString)
                             ^
<https://builds.apache.org/job/kafka-trunk-jdk8/ws/core/src/main/scala/kafka/tools/ConsoleProducer.scala>:117:
value TIMEOUT_CONFIG in object ProducerConfig is deprecated: see corresponding Javadoc for
more information.
    props.put(ProducerConfig.TIMEOUT_CONFIG, config.requestTimeoutMs.toString)
                             ^
<https://builds.apache.org/job/kafka-trunk-jdk8/ws/core/src/main/scala/kafka/tools/ConsoleProducer.scala>:121:
value BLOCK_ON_BUFFER_FULL_CONFIG in object ProducerConfig is deprecated: see corresponding
Javadoc for more information.
      props.put(ProducerConfig.BLOCK_ON_BUFFER_FULL_CONFIG, "false")
                               ^
<https://builds.apache.org/job/kafka-trunk-jdk8/ws/core/src/main/scala/kafka/tools/EndToEndLatency.scala>:75:
value BLOCK_ON_BUFFER_FULL_CONFIG in object ProducerConfig is deprecated: see corresponding
Javadoc for more information.
    producerProps.put(ProducerConfig.BLOCK_ON_BUFFER_FULL_CONFIG, "true")
                                     ^
<https://builds.apache.org/job/kafka-trunk-jdk8/ws/core/src/main/scala/kafka/tools/MirrorMaker.scala>:194:
value BLOCK_ON_BUFFER_FULL_CONFIG in object ProducerConfig is deprecated: see corresponding
Javadoc for more information.
      maybeSetDefaultProperty(producerProps, ProducerConfig.BLOCK_ON_BUFFER_FULL_CONFIG, "true")
                                                            ^
<https://builds.apache.org/job/kafka-trunk-jdk8/ws/core/src/main/scala/kafka/controller/ControllerChannelManager.scala>:389:
class BrokerEndPoint in object UpdateMetadataRequest is deprecated: see corresponding Javadoc
for more information.
              new UpdateMetadataRequest.BrokerEndPoint(brokerEndPoint.id, brokerEndPoint.host,
brokerEndPoint.port)
                                        ^
<https://builds.apache.org/job/kafka-trunk-jdk8/ws/core/src/main/scala/kafka/controller/ControllerChannelManager.scala>:391:
constructor UpdateMetadataRequest in class UpdateMetadataRequest is deprecated: see corresponding
Javadoc for more information.
            new UpdateMetadataRequest(controllerId, controllerEpoch, liveBrokers.asJava, partitionStates.asJava)
            ^
<https://builds.apache.org/job/kafka-trunk-jdk8/ws/core/src/main/scala/kafka/network/BlockingChannel.scala>:129:
method readFromReadableChannel in class NetworkReceive is deprecated: see corresponding Javadoc
for more information.
      response.readFromReadableChannel(channel)
               ^
there were 15 feature warning(s); re-run with -feature for details
16 warnings found
warning: [options] bootstrap class path not set in conjunction with -source 1.7
1 warning
:core:processResources UP-TO-DATE
:core:classes
:clients:compileTestJava UP-TO-DATE
:clients:processTestResources UP-TO-DATE
:clients:testClasses UP-TO-DATE
:core:copyDependantLibs UP-TO-DATE
:core:jar UP-TO-DATE
:examples:compileJavawarning: [options] bootstrap class path not set in conjunction with -source
1.7
1 warning

:examples:processResources UP-TO-DATE
:examples:classes
:examples:jar
:streams:compileJavawarning: [options] bootstrap class path not set in conjunction with -source
1.7
Note: Some input files use unchecked or unsafe operations.
Note: Recompile with -Xlint:unchecked for details.
1 warning

:streams:processResources UP-TO-DATE
:streams:classes
:clients:javadoc<https://builds.apache.org/job/kafka-trunk-jdk8/ws/clients/src/main/java/org/apache/kafka/clients/consumer/KafkaConsumer.java>:1166:
warning - Tag @link: reference not found: WakeupException

1 warning
:clients:javadocJar
:clients:srcJar
:clients:testJar
:clients:signArchives SKIPPED
:streams:copyDependantLibs
:streams:jar
:tools:compileJavawarning: [options] bootstrap class path not set in conjunction with -source
1.7
1 warning

:tools:processResources UP-TO-DATE
:tools:classes
:tools:copyDependantLibs
:tools:jar
:contrib:hadoop-consumer:compileJavawarning: [options] bootstrap class path not set in conjunction
with -source 1.7
Note: Some input files use or override a deprecated API.
Note: Recompile with -Xlint:deprecation for details.
Note: Some input files use unchecked or unsafe operations.
Note: Recompile with -Xlint:unchecked for details.
1 warning

:contrib:hadoop-consumer:processResources UP-TO-DATE
:contrib:hadoop-consumer:classes
:contrib:hadoop-consumer:jar
:contrib:hadoop-producer:compileJavawarning: [options] bootstrap class path not set in conjunction
with -source 1.7
1 warning

:contrib:hadoop-producer:processResources UP-TO-DATE
:contrib:hadoop-producer:classes
:contrib:hadoop-producer:jar
:copycat:api:compileJavawarning: [options] bootstrap class path not set in conjunction with
-source 1.7
Note: <https://builds.apache.org/job/kafka-trunk-jdk8/ws/copycat/api/src/main/java/org/apache/kafka/copycat/data/Struct.java>
uses unchecked or unsafe operations.
Note: Recompile with -Xlint:unchecked for details.
1 warning

:copycat:api:processResources UP-TO-DATE
:copycat:api:classes
:copycat:api:copyDependantLibs
:copycat:api:jar
:copycat:file:compileJavawarning: [options] bootstrap class path not set in conjunction with
-source 1.7
1 warning

:copycat:file:processResources UP-TO-DATE
:copycat:file:classes
:copycat:file:copyDependantLibs
Download https://repo1.maven.org/maven2/org/powermock/powermock-module-junit4/1.6.2/powermock-module-junit4-1.6.2.pom
Download https://repo1.maven.org/maven2/org/powermock/powermock-modules/1.6.2/powermock-modules-1.6.2.pom
Download https://repo1.maven.org/maven2/org/powermock/powermock/1.6.2/powermock-1.6.2.pom
Download https://repo1.maven.org/maven2/org/powermock/powermock-api-easymock/1.6.2/powermock-api-easymock-1.6.2.pom
Download https://repo1.maven.org/maven2/org/powermock/powermock-api/1.6.2/powermock-api-1.6.2.pom
Download https://repo1.maven.org/maven2/org/powermock/powermock-module-junit4-common/1.6.2/powermock-module-junit4-common-1.6.2.pom
Download https://repo1.maven.org/maven2/org/powermock/powermock-api-support/1.6.2/powermock-api-support-1.6.2.pom
Download https://repo1.maven.org/maven2/org/powermock/powermock-core/1.6.2/powermock-core-1.6.2.pom
Download https://repo1.maven.org/maven2/org/powermock/powermock-reflect/1.6.2/powermock-reflect-1.6.2.pom
Download https://repo1.maven.org/maven2/org/javassist/javassist/3.19.0-GA/javassist-3.19.0-GA.pom
Download https://repo1.maven.org/maven2/org/powermock/powermock-module-junit4/1.6.2/powermock-module-junit4-1.6.2.jar
Download https://repo1.maven.org/maven2/org/powermock/powermock-api-easymock/1.6.2/powermock-api-easymock-1.6.2.jar
Download https://repo1.maven.org/maven2/org/powermock/powermock-module-junit4-common/1.6.2/powermock-module-junit4-common-1.6.2.jar
Download https://repo1.maven.org/maven2/org/powermock/powermock-api-support/1.6.2/powermock-api-support-1.6.2.jar
Download https://repo1.maven.org/maven2/org/powermock/powermock-core/1.6.2/powermock-core-1.6.2.jar
Download https://repo1.maven.org/maven2/org/powermock/powermock-reflect/1.6.2/powermock-reflect-1.6.2.jar
Download https://repo1.maven.org/maven2/org/javassist/javassist/3.19.0-GA/javassist-3.19.0-GA.jar
:copycat:file:jar
:copycat:json:compileJavawarning: [options] bootstrap class path not set in conjunction with
-source 1.7
Note: <https://builds.apache.org/job/kafka-trunk-jdk8/ws/copycat/json/src/main/java/org/apache/kafka/copycat/json/JsonConverter.java>
uses or overrides a deprecated API.
Note: Recompile with -Xlint:deprecation for details.
1 warning

:copycat:json:processResources UP-TO-DATE
:copycat:json:classes
:copycat:json:copyDependantLibs
:copycat:json:jar
:copycat:runtime:compileJava
Download https://repo1.maven.org/maven2/org/eclipse/jetty/jetty-server/9.2.12.v20150709/jetty-server-9.2.12.v20150709.pom
Download https://repo1.maven.org/maven2/org/eclipse/jetty/jetty-project/9.2.12.v20150709/jetty-project-9.2.12.v20150709.pom
Download https://repo1.maven.org/maven2/org/eclipse/jetty/jetty-parent/23/jetty-parent-23.pom
Download https://repo1.maven.org/maven2/org/eclipse/jetty/jetty-servlet/9.2.12.v20150709/jetty-servlet-9.2.12.v20150709.pom
Download https://repo1.maven.org/maven2/com/fasterxml/jackson/jaxrs/jackson-jaxrs-json-provider/2.5.4/jackson-jaxrs-json-provider-2.5.4.pom
Download https://repo1.maven.org/maven2/com/fasterxml/jackson/jaxrs/jackson-jaxrs-providers/2.5.4/jackson-jaxrs-providers-2.5.4.pom
Download https://repo1.maven.org/maven2/org/glassfish/jersey/containers/jersey-container-servlet/2.22.1/jersey-container-servlet-2.22.1.pom
Download https://repo1.maven.org/maven2/org/glassfish/jersey/containers/project/2.22.1/project-2.22.1.pom
Download https://repo1.maven.org/maven2/org/glassfish/jersey/project/2.22.1/project-2.22.1.pom
Download https://repo1.maven.org/maven2/net/java/jvnet-parent/4/jvnet-parent-4.pom
Download https://repo1.maven.org/maven2/org/glassfish/hk2/hk2-bom/2.4.0-b31/hk2-bom-2.4.0-b31.pom
Download https://repo1.maven.org/maven2/net/java/jvnet-parent/5/jvnet-parent-5.pom
Download https://repo1.maven.org/maven2/javax/servlet/javax.servlet-api/3.1.0/javax.servlet-api-3.1.0.pom
Download https://repo1.maven.org/maven2/net/java/jvnet-parent/3/jvnet-parent-3.pom
Download https://repo1.maven.org/maven2/org/eclipse/jetty/jetty-http/9.2.12.v20150709/jetty-http-9.2.12.v20150709.pom
Download https://repo1.maven.org/maven2/org/eclipse/jetty/jetty-io/9.2.12.v20150709/jetty-io-9.2.12.v20150709.pom
Download https://repo1.maven.org/maven2/org/eclipse/jetty/jetty-security/9.2.12.v20150709/jetty-security-9.2.12.v20150709.pom
Download https://repo1.maven.org/maven2/com/fasterxml/jackson/jaxrs/jackson-jaxrs-base/2.5.4/jackson-jaxrs-base-2.5.4.pom
Download https://repo1.maven.org/maven2/com/fasterxml/jackson/module/jackson-module-jaxb-annotations/2.5.4/jackson-module-jaxb-annotations-2.5.4.pom
Download https://repo1.maven.org/maven2/org/glassfish/jersey/containers/jersey-container-servlet-core/2.22.1/jersey-container-servlet-core-2.22.1.pom
Download https://repo1.maven.org/maven2/org/glassfish/jersey/core/jersey-common/2.22.1/jersey-common-2.22.1.pom
Download https://repo1.maven.org/maven2/org/glassfish/jersey/core/jersey-server/2.22.1/jersey-server-2.22.1.pom
Download https://repo1.maven.org/maven2/javax/ws/rs/javax.ws.rs-api/2.0.1/javax.ws.rs-api-2.0.1.pom
Download https://repo1.maven.org/maven2/org/eclipse/jetty/jetty-util/9.2.12.v20150709/jetty-util-9.2.12.v20150709.pom
Download https://repo1.maven.org/maven2/org/glassfish/hk2/external/javax.inject/2.4.0-b31/javax.inject-2.4.0-b31.pom
Download https://repo1.maven.org/maven2/org/glassfish/hk2/external/2.4.0-b31/external-2.4.0-b31.pom
Download https://repo1.maven.org/maven2/org/glassfish/hk2/hk2-parent/2.4.0-b31/hk2-parent-2.4.0-b31.pom
Download https://repo1.maven.org/maven2/javax/annotation/javax.annotation-api/1.2/javax.annotation-api-1.2.pom
Download https://repo1.maven.org/maven2/org/glassfish/jersey/bundles/repackaged/jersey-guava/2.22.1/jersey-guava-2.22.1.pom
Download https://repo1.maven.org/maven2/org/glassfish/jersey/bundles/repackaged/project/2.22.1/project-2.22.1.pom
Download https://repo1.maven.org/maven2/org/glassfish/jersey/bundles/project/2.22.1/project-2.22.1.pom
Download https://repo1.maven.org/maven2/org/glassfish/hk2/hk2-api/2.4.0-b31/hk2-api-2.4.0-b31.pom
Download https://repo1.maven.org/maven2/org/glassfish/hk2/hk2-locator/2.4.0-b31/hk2-locator-2.4.0-b31.pom
Download https://repo1.maven.org/maven2/org/glassfish/hk2/osgi-resource-locator/1.0.1/osgi-resource-locator-1.0.1.pom
Download https://repo1.maven.org/maven2/org/glassfish/pom/8/pom-8.pom
Download https://repo1.maven.org/maven2/org/glassfish/jersey/core/jersey-client/2.22.1/jersey-client-2.22.1.pom
Download https://repo1.maven.org/maven2/org/glassfish/jersey/media/jersey-media-jaxb/2.22.1/jersey-media-jaxb-2.22.1.pom
Download https://repo1.maven.org/maven2/org/glassfish/jersey/media/project/2.22.1/project-2.22.1.pom
Download https://repo1.maven.org/maven2/javax/validation/validation-api/1.1.0.Final/validation-api-1.1.0.Final.pom
Download https://repo1.maven.org/maven2/org/glassfish/hk2/hk2-utils/2.4.0-b31/hk2-utils-2.4.0-b31.pom
Download https://repo1.maven.org/maven2/org/glassfish/hk2/external/aopalliance-repackaged/2.4.0-b31/aopalliance-repackaged-2.4.0-b31.pom
Download https://repo1.maven.org/maven2/org/javassist/javassist/3.18.1-GA/javassist-3.18.1-GA.pom
Download https://repo1.maven.org/maven2/org/eclipse/jetty/jetty-server/9.2.12.v20150709/jetty-server-9.2.12.v20150709.jar
Download https://repo1.maven.org/maven2/org/eclipse/jetty/jetty-servlet/9.2.12.v20150709/jetty-servlet-9.2.12.v20150709.jar
Download https://repo1.maven.org/maven2/com/fasterxml/jackson/jaxrs/jackson-jaxrs-json-provider/2.5.4/jackson-jaxrs-json-provider-2.5.4.jar
Download https://repo1.maven.org/maven2/org/glassfish/jersey/containers/jersey-container-servlet/2.22.1/jersey-container-servlet-2.22.1.jar
Download https://repo1.maven.org/maven2/javax/servlet/javax.servlet-api/3.1.0/javax.servlet-api-3.1.0.jar
Download https://repo1.maven.org/maven2/org/eclipse/jetty/jetty-http/9.2.12.v20150709/jetty-http-9.2.12.v20150709.jar
Download https://repo1.maven.org/maven2/org/eclipse/jetty/jetty-io/9.2.12.v20150709/jetty-io-9.2.12.v20150709.jar
Download https://repo1.maven.org/maven2/org/eclipse/jetty/jetty-security/9.2.12.v20150709/jetty-security-9.2.12.v20150709.jar
Download https://repo1.maven.org/maven2/com/fasterxml/jackson/jaxrs/jackson-jaxrs-base/2.5.4/jackson-jaxrs-base-2.5.4.jar
Download https://repo1.maven.org/maven2/com/fasterxml/jackson/module/jackson-module-jaxb-annotations/2.5.4/jackson-module-jaxb-annotations-2.5.4.jar
Download https://repo1.maven.org/maven2/org/glassfish/jersey/containers/jersey-container-servlet-core/2.22.1/jersey-container-servlet-core-2.22.1.jar
Download https://repo1.maven.org/maven2/org/glassfish/jersey/core/jersey-common/2.22.1/jersey-common-2.22.1.jar
Download https://repo1.maven.org/maven2/org/glassfish/jersey/core/jersey-server/2.22.1/jersey-server-2.22.1.jar
Download https://repo1.maven.org/maven2/javax/ws/rs/javax.ws.rs-api/2.0.1/javax.ws.rs-api-2.0.1.jar
Download https://repo1.maven.org/maven2/org/eclipse/jetty/jetty-util/9.2.12.v20150709/jetty-util-9.2.12.v20150709.jar
Download https://repo1.maven.org/maven2/org/glassfish/hk2/external/javax.inject/2.4.0-b31/javax.inject-2.4.0-b31.jar
Download https://repo1.maven.org/maven2/javax/annotation/javax.annotation-api/1.2/javax.annotation-api-1.2.jar
Download https://repo1.maven.org/maven2/org/glassfish/jersey/bundles/repackaged/jersey-guava/2.22.1/jersey-guava-2.22.1.jar
Download https://repo1.maven.org/maven2/org/glassfish/hk2/hk2-api/2.4.0-b31/hk2-api-2.4.0-b31.jar
Download https://repo1.maven.org/maven2/org/glassfish/hk2/hk2-locator/2.4.0-b31/hk2-locator-2.4.0-b31.jar
Download https://repo1.maven.org/maven2/org/glassfish/hk2/osgi-resource-locator/1.0.1/osgi-resource-locator-1.0.1.jar
Download https://repo1.maven.org/maven2/org/glassfish/jersey/core/jersey-client/2.22.1/jersey-client-2.22.1.jar
Download https://repo1.maven.org/maven2/org/glassfish/jersey/media/jersey-media-jaxb/2.22.1/jersey-media-jaxb-2.22.1.jar
Download https://repo1.maven.org/maven2/javax/validation/validation-api/1.1.0.Final/validation-api-1.1.0.Final.jar
Download https://repo1.maven.org/maven2/org/glassfish/hk2/hk2-utils/2.4.0-b31/hk2-utils-2.4.0-b31.jar
Download https://repo1.maven.org/maven2/org/glassfish/hk2/external/aopalliance-repackaged/2.4.0-b31/aopalliance-repackaged-2.4.0-b31.jar
Download https://repo1.maven.org/maven2/org/javassist/javassist/3.18.1-GA/javassist-3.18.1-GA.jar
warning: [options] bootstrap class path not set in conjunction with -source 1.7
Note: Some input files use unchecked or unsafe operations.
Note: Recompile with -Xlint:unchecked for details.
1 warning
:copycat:runtime:processResources UP-TO-DATE
:copycat:runtime:classes
:copycat:runtime:copyDependantLibs
:copycat:runtime:jar
:jarAll
:docsJar_2_10_5
Building project 'core' with Scala version 2.10.5
:kafka-trunk-jdk8:clients:compileJava UP-TO-DATE
:kafka-trunk-jdk8:clients:processResources UP-TO-DATE
:kafka-trunk-jdk8:clients:classes UP-TO-DATE
:kafka-trunk-jdk8:clients:determineCommitId UP-TO-DATE
:kafka-trunk-jdk8:clients:createVersionFile
:kafka-trunk-jdk8:clients:jar UP-TO-DATE
:kafka-trunk-jdk8:clients:javadoc UP-TO-DATE
:kafka-trunk-jdk8:log4j-appender:compileJava UP-TO-DATE
:kafka-trunk-jdk8:log4j-appender:processResources UP-TO-DATE
:kafka-trunk-jdk8:log4j-appender:classes UP-TO-DATE
:kafka-trunk-jdk8:log4j-appender:jar UP-TO-DATE
:kafka-trunk-jdk8:core:compileJava UP-TO-DATE
:kafka-trunk-jdk8:core:compileScala UP-TO-DATE
:kafka-trunk-jdk8:core:processResources UP-TO-DATE
:kafka-trunk-jdk8:core:classes UP-TO-DATE
:kafka-trunk-jdk8:log4j-appender:javadoc
:kafka-trunk-jdk8:core:javadoc
:docsJar_2_10_5 FAILED

FAILURE: Build failed with an exception.

* What went wrong:
Could not read entry ':core:javadoc' from cache taskArtifacts.bin (<https://builds.apache.org/job/kafka-trunk-jdk8/ws/.gradle/2.8/taskArtifacts/taskArtifacts.bin).>
> java.io.EOFException (no error message)

* Try:
Run with --stacktrace option to get the stack trace. Run with --info or --debug option to
get more log output.

BUILD FAILED

Total time: 3 mins 29.166 secs
Build step 'Execute shell' marked build as failure
Recording test results
Setting GRADLE_2_1_HOME=/jenkins/tools/hudson.plugins.gradle.GradleInstallation/Gradle_2.1
Setting JDK1_8_0_45_HOME=/jenkins/tools/hudson.model.JDK/jdk1.8.0_45
ERROR: Publisher 'Publish JUnit test result report' failed: No test report files were found.
Configuration error?
Setting GRADLE_2_1_HOME=/jenkins/tools/hudson.plugins.gradle.GradleInstallation/Gradle_2.1
Setting JDK1_8_0_45_HOME=/jenkins/tools/hudson.model.JDK/jdk1.8.0_45

Mime
View raw message