kafka-dev mailing list archives

Site index · List index
Message view « Date » · « Thread »
Top « Date » · « Thread »
From Apache Jenkins Server <jenk...@builds.apache.org>
Subject Build failed in Jenkins: kafka-trunk-jdk8 #49
Date Thu, 22 Oct 2015 02:23:26 GMT
See <https://builds.apache.org/job/kafka-trunk-jdk8/49/changes>

Changes:

[junrao] KAFKA-2456 KAFKA-2472; SSL clean-ups

------------------------------------------
[...truncated 6820 lines...]

org.apache.kafka.copycat.file.FileStreamSourceConnectorTest > testSourceTasksStdin PASSED

org.apache.kafka.copycat.file.FileStreamSourceConnectorTest > testTaskClass PASSED

org.apache.kafka.copycat.file.FileStreamSourceConnectorTest > testMultipleSourcesInvalid
PASSED

org.apache.kafka.copycat.file.FileStreamSinkConnectorTest > testSinkTasks PASSED

org.apache.kafka.copycat.file.FileStreamSinkConnectorTest > testTaskClass PASSED

org.apache.kafka.copycat.file.FileStreamSinkTaskTest > testPutFlush PASSED
:copycat:json:checkstyleMain
:copycat:json:compileTestJavawarning: [options] bootstrap class path not set in conjunction
with -source 1.7
Note: <https://builds.apache.org/job/kafka-trunk-jdk8/ws/copycat/json/src/test/java/org/apache/kafka/copycat/json/JsonConverterTest.java>
uses unchecked or unsafe operations.
Note: Recompile with -Xlint:unchecked for details.
1 warning

:copycat:json:processTestResources UP-TO-DATE
:copycat:json:testClasses
:copycat:json:checkstyleTest
:copycat:json:test

org.apache.kafka.copycat.json.JsonConverterTest > longToCopycat PASSED

org.apache.kafka.copycat.json.JsonConverterTest > testCacheSchemaToJsonConversion PASSED

org.apache.kafka.copycat.json.JsonConverterTest > nullSchemaAndMapNonStringKeysToJson PASSED

org.apache.kafka.copycat.json.JsonConverterTest > floatToJson PASSED

org.apache.kafka.copycat.json.JsonConverterTest > booleanToCopycat PASSED

org.apache.kafka.copycat.json.JsonConverterTest > nullSchemaAndMapToJson PASSED

org.apache.kafka.copycat.json.JsonConverterTest > stringToCopycat PASSED

org.apache.kafka.copycat.json.JsonConverterTest > timestampToJson PASSED

org.apache.kafka.copycat.json.JsonConverterTest > testCopycatSchemaMetadataTranslation
PASSED

org.apache.kafka.copycat.json.JsonConverterTest > timestampToCopycat PASSED

org.apache.kafka.copycat.json.JsonConverterTest > decimalToCopycat PASSED

org.apache.kafka.copycat.json.JsonConverterTest > mapToCopycatStringKeys PASSED

org.apache.kafka.copycat.json.JsonConverterTest > mapToJsonNonStringKeys PASSED

org.apache.kafka.copycat.json.JsonConverterTest > longToJson PASSED

org.apache.kafka.copycat.json.JsonConverterTest > mismatchSchemaJson PASSED

org.apache.kafka.copycat.json.JsonConverterTest > testCacheSchemaToCopycatConversion PASSED

org.apache.kafka.copycat.json.JsonConverterTest > testJsonSchemaMetadataTranslation PASSED

org.apache.kafka.copycat.json.JsonConverterTest > bytesToJson PASSED

org.apache.kafka.copycat.json.JsonConverterTest > shortToCopycat PASSED

org.apache.kafka.copycat.json.JsonConverterTest > intToJson PASSED

org.apache.kafka.copycat.json.JsonConverterTest > structToCopycat PASSED

org.apache.kafka.copycat.json.JsonConverterTest > stringToJson PASSED

org.apache.kafka.copycat.json.JsonConverterTest > nullSchemaAndArrayToJson PASSED

org.apache.kafka.copycat.json.JsonConverterTest > byteToCopycat PASSED

org.apache.kafka.copycat.json.JsonConverterTest > nullSchemaPrimitiveToCopycat PASSED

org.apache.kafka.copycat.json.JsonConverterTest > byteToJson PASSED

org.apache.kafka.copycat.json.JsonConverterTest > intToCopycat PASSED

org.apache.kafka.copycat.json.JsonConverterTest > dateToJson PASSED

org.apache.kafka.copycat.json.JsonConverterTest > noSchemaToCopycat PASSED

org.apache.kafka.copycat.json.JsonConverterTest > noSchemaToJson PASSED

org.apache.kafka.copycat.json.JsonConverterTest > nullSchemaAndPrimitiveToJson PASSED

org.apache.kafka.copycat.json.JsonConverterTest > mapToJsonStringKeys PASSED

org.apache.kafka.copycat.json.JsonConverterTest > arrayToJson PASSED

org.apache.kafka.copycat.json.JsonConverterTest > nullToCopycat PASSED

org.apache.kafka.copycat.json.JsonConverterTest > timeToJson PASSED

org.apache.kafka.copycat.json.JsonConverterTest > structToJson PASSED

org.apache.kafka.copycat.json.JsonConverterTest > shortToJson PASSED

org.apache.kafka.copycat.json.JsonConverterTest > dateToCopycat PASSED

org.apache.kafka.copycat.json.JsonConverterTest > doubleToJson PASSED

org.apache.kafka.copycat.json.JsonConverterTest > timeToCopycat PASSED

org.apache.kafka.copycat.json.JsonConverterTest > floatToCopycat PASSED

org.apache.kafka.copycat.json.JsonConverterTest > decimalToJson PASSED

org.apache.kafka.copycat.json.JsonConverterTest > arrayToCopycat PASSED

org.apache.kafka.copycat.json.JsonConverterTest > booleanToJson PASSED

org.apache.kafka.copycat.json.JsonConverterTest > mapToCopycatNonStringKeys PASSED

org.apache.kafka.copycat.json.JsonConverterTest > bytesToCopycat PASSED

org.apache.kafka.copycat.json.JsonConverterTest > doubleToCopycat PASSED
:copycat:runtime:checkstyleMain
:copycat:runtime:compileTestJavawarning: [options] bootstrap class path not set in conjunction
with -source 1.7
Note: Some input files use unchecked or unsafe operations.
Note: Recompile with -Xlint:unchecked for details.
1 warning

:copycat:runtime:processTestResources
:copycat:runtime:testClasses
:copycat:runtime:checkstyleTest
:copycat:runtime:test

org.apache.kafka.copycat.runtime.WorkerSinkTaskTest > testPollsInBackground PASSED

org.apache.kafka.copycat.runtime.WorkerSinkTaskTest > testDeliverConvertsData PASSED

org.apache.kafka.copycat.runtime.WorkerSinkTaskTest > testCommit PASSED

org.apache.kafka.copycat.runtime.WorkerSinkTaskTest > testCommitTaskFlushFailure PASSED

org.apache.kafka.copycat.runtime.WorkerSinkTaskTest > testCommitConsumerFailure PASSED

org.apache.kafka.copycat.runtime.WorkerSinkTaskTest > testCommitTimeout PASSED

org.apache.kafka.copycat.runtime.WorkerSinkTaskTest > testAssignmentPauseResume PASSED

org.apache.kafka.copycat.runtime.WorkerSourceTaskTest > testPollsInBackground PASSED

org.apache.kafka.copycat.runtime.WorkerSourceTaskTest > testCommit PASSED

org.apache.kafka.copycat.runtime.WorkerSourceTaskTest > testCommitFailure PASSED

org.apache.kafka.copycat.runtime.WorkerSourceTaskTest > testSendRecordsConvertsData PASSED

org.apache.kafka.copycat.runtime.WorkerTest > testAddRemoveTask PASSED

org.apache.kafka.copycat.runtime.WorkerTest > testCleanupTasksOnStop PASSED

org.apache.kafka.copycat.runtime.WorkerTest > testStopInvalidTask PASSED

org.apache.kafka.copycat.runtime.standalone.StandaloneHerderTest > testCreateSourceConnector
PASSED

org.apache.kafka.copycat.runtime.standalone.StandaloneHerderTest > testCreateSinkConnector
PASSED

org.apache.kafka.copycat.runtime.standalone.StandaloneHerderTest > testDestroyConnector
PASSED

org.apache.kafka.copycat.runtime.standalone.StandaloneHerderTest > testCreateAndStop PASSED

org.apache.kafka.copycat.runtime.distributed.DistributedHerderTest > testCreateSourceConnector
PASSED

org.apache.kafka.copycat.runtime.distributed.DistributedHerderTest > testCreateSinkConnector
PASSED

org.apache.kafka.copycat.runtime.distributed.DistributedHerderTest > testDestroyConnector
PASSED

org.apache.kafka.copycat.runtime.distributed.DistributedHerderTest > testCreateAndStop
PASSED

org.apache.kafka.copycat.runtime.distributed.DistributedHerderTest > testRestoreAndStop
PASSED

org.apache.kafka.copycat.util.ShutdownableThreadTest > testGracefulShutdown PASSED

org.apache.kafka.copycat.util.ShutdownableThreadTest > testForcibleShutdown PASSED

org.apache.kafka.copycat.util.KafkaBasedLogTest > testConsumerError PASSED

org.apache.kafka.copycat.util.KafkaBasedLogTest > testProducerError PASSED

org.apache.kafka.copycat.util.KafkaBasedLogTest > testSendAndReadToEnd FAILED
    java.lang.AssertionError
        at org.junit.Assert.fail(Assert.java:86)
        at org.junit.Assert.assertTrue(Assert.java:41)
        at org.junit.Assert.assertTrue(Assert.java:52)
        at org.apache.kafka.copycat.util.KafkaBasedLogTest.testSendAndReadToEnd(KafkaBasedLogTest.java:314)

org.apache.kafka.copycat.util.KafkaBasedLogTest > testStartStop PASSED

org.apache.kafka.copycat.util.KafkaBasedLogTest > testReloadOnStart PASSED

org.apache.kafka.copycat.storage.KafkaOffsetBackingStoreTest > testStartStop PASSED

org.apache.kafka.copycat.storage.KafkaOffsetBackingStoreTest > testReloadOnStart PASSED

org.apache.kafka.copycat.storage.KafkaOffsetBackingStoreTest > testMissingTopic PASSED

org.apache.kafka.copycat.storage.KafkaOffsetBackingStoreTest > testGetSet PASSED

org.apache.kafka.copycat.storage.KafkaOffsetBackingStoreTest > testSetFailure PASSED

org.apache.kafka.copycat.storage.KafkaConfigStorageTest > testStartStop PASSED

org.apache.kafka.copycat.storage.KafkaConfigStorageTest > testPutConnectorConfig PASSED

org.apache.kafka.copycat.storage.KafkaConfigStorageTest > testPutTaskConfigs PASSED

org.apache.kafka.copycat.storage.KafkaConfigStorageTest > testRestore PASSED

org.apache.kafka.copycat.storage.KafkaConfigStorageTest > testPutTaskConfigsDoesNotResolveAllInconsistencies
PASSED

org.apache.kafka.copycat.storage.OffsetStorageWriterTest > testNoOffsetsToFlush PASSED

org.apache.kafka.copycat.storage.OffsetStorageWriterTest > testWriteFlush PASSED

org.apache.kafka.copycat.storage.OffsetStorageWriterTest > testFlushFailureReplacesOffsets
PASSED

org.apache.kafka.copycat.storage.OffsetStorageWriterTest > testCancelBeforeAwaitFlush PASSED

org.apache.kafka.copycat.storage.OffsetStorageWriterTest > testAlreadyFlushing PASSED

org.apache.kafka.copycat.storage.OffsetStorageWriterTest > testCancelAfterAwaitFlush PASSED

org.apache.kafka.copycat.storage.FileOffsetBackingStoreTest > testSaveRestore PASSED

org.apache.kafka.copycat.storage.FileOffsetBackingStoreTest > testGetSet PASSED

48 tests completed, 1 failed
:copycat:runtime:test FAILED

FAILURE: Build failed with an exception.

* What went wrong:
Execution failed for task ':copycat:runtime:test'.
> There were failing tests. See the report at: file://<https://builds.apache.org/job/kafka-trunk-jdk8/ws/copycat/runtime/build/reports/tests/index.html>

* Try:
Run with --stacktrace option to get the stack trace. Run with --info or --debug option to
get more log output.

BUILD FAILED

Total time: 1 hrs 20 mins 9.73 secs
Build step 'Execute shell' marked build as failure
Recording test results
Setting GRADLE_2_1_HOME=/jenkins/tools/hudson.plugins.gradle.GradleInstallation/Gradle_2.1
Setting JDK1_8_0_45_HOME=/jenkins/tools/hudson.model.JDK/jdk1.8.0_45
Setting GRADLE_2_1_HOME=/jenkins/tools/hudson.plugins.gradle.GradleInstallation/Gradle_2.1
Setting JDK1_8_0_45_HOME=/jenkins/tools/hudson.model.JDK/jdk1.8.0_45

Mime
View raw message