kafka-dev mailing list archives

Site index · List index
Message view « Date » · « Thread »
Top « Date » · « Thread »
From Apache Jenkins Server <jenk...@builds.apache.org>
Subject Build failed in Jenkins: Kafka-trunk #654
Date Fri, 02 Oct 2015 22:13:23 GMT
See <https://builds.apache.org/job/Kafka-trunk/654/changes>

Changes:

[junrao] KAFKA-2517; Performance Regression post SSL implementation (zero copy)

[wangguoz] MINOR: Fix Vagrant setup script for use on Fedora

[wangguoz] MINOR: remove no longer needed CommitType

------------------------------------------
[...truncated 1728 lines...]
kafka.common.ConfigTest > testInvalidClientIds PASSED

kafka.admin.AddPartitionsTest > testReplicaPlacement PASSED

kafka.controller.ControllerFailoverTest > testMetadataUpdate PASSED

kafka.network.SocketServerTest > testMaxConnectionsPerIp PASSED

kafka.network.SocketServerTest > simpleRequest PASSED

kafka.network.SocketServerTest > testSessionPrincipal PASSED

kafka.network.SocketServerTest > testSocketsCloseOnShutdown PASSED

kafka.network.SocketServerTest > testMaxConnectionsPerIPOverrides PASSED

kafka.log.LogCleanerIntegrationTest > cleanerTest[0] PASSED

kafka.admin.DeleteTopicTest > testPartitionReassignmentDuringDeleteTopic PASSED

kafka.api.ConsumerTest > testListTopics PASSED

kafka.network.SocketServerTest > testSSLSocketServer PASSED

kafka.integration.FetcherTest > testFetcher PASSED

kafka.zk.ZKEphemeralTest > testZkWatchedEphemeralRecursive PASSED

kafka.zk.ZKEphemeralTest > testOverlappingSessions PASSED

kafka.network.SocketServerTest > tooBigRequestIsRejected PASSED

kafka.zk.ZKEphemeralTest > testEphemeralNodeCleanup PASSED

kafka.zk.ZKEphemeralTest > testZkWatchedEphemeral PASSED

kafka.zk.ZKEphemeralTest > testSameSession PASSED

kafka.api.QuotasTest > testThrottledProducerConsumer PASSED

kafka.utils.ReplicationUtilsTest > testUpdateLeaderAndIsr PASSED

kafka.utils.ReplicationUtilsTest > testGetLeaderIsrAndEpochForPartition PASSED

kafka.admin.DeleteTopicTest > testDeleteNonExistingTopic PASSED

kafka.integration.UncleanLeaderElectionTest > testUncleanLeaderElectionEnabled PASSED

kafka.api.ConsumerTest > testExpandingTopicSubscriptions PASSED

kafka.log.LogTest > testCorruptLog PASSED

kafka.log.LogTest > testLogRecoversToCorrectOffset PASSED

kafka.log.LogTest > testReopenThenTruncate PASSED

kafka.log.LogTest > testParseTopicPartitionNameForMissingPartition PASSED

kafka.log.LogTest > testParseTopicPartitionNameForEmptyName PASSED

kafka.log.LogTest > testOpenDeletesObsoleteFiles PASSED

kafka.log.LogTest > testSizeBasedLogRoll PASSED

kafka.log.LogTest > testTimeBasedLogRollJitter PASSED

kafka.log.LogTest > testParseTopicPartitionName PASSED

kafka.admin.DeleteTopicTest > testRecreateTopicAfterDeletion PASSED

kafka.log.LogTest > testTruncateTo PASSED

kafka.log.LogTest > testCleanShutdownFile PASSED

kafka.api.ProducerFailureHandlingTest > testCannotSendToInternalTopic PASSED

kafka.admin.DeleteTopicTest > testAddPartitionDuringDeleteTopic PASSED

kafka.api.ConsumerBounceTest > testConsumptionWithBrokerFailures PASSED

kafka.utils.ByteBoundedBlockingQueueTest > testByteBoundedBlockingQueue PASSED

kafka.api.ConsumerTest > testPatternUnsubscription PASSED

kafka.api.ProducerFailureHandlingTest > testTooLargeRecordWithAckOne PASSED

kafka.admin.DeleteTopicTest > testDeleteTopicWithAllAliveReplicas PASSED

kafka.api.ConsumerTest > testGroupConsumption PASSED

kafka.api.ProducerFailureHandlingTest > testWrongBrokerList PASSED

kafka.log.LogCleanerIntegrationTest > cleanerTest[1] PASSED

kafka.api.ProducerFailureHandlingTest > testNotEnoughReplicas PASSED

kafka.admin.DeleteTopicTest > testDeleteTopicDuringAddPartition PASSED

kafka.integration.UncleanLeaderElectionTest > testCleanLeaderElectionDisabledByTopicOverride
PASSED

kafka.api.ConsumerTest > testPartitionsFor PASSED

kafka.api.ProducerFailureHandlingTest > testNonExistentTopic PASSED

kafka.api.ConsumerTest > testAutoCommitOnRebalance PASSED

kafka.api.ProducerFailureHandlingTest > testInvalidPartition PASSED

kafka.api.ProducerFailureHandlingTest > testSendAfterClosed PASSED

kafka.integration.RollingBounceTest > testRollingBounce PASSED

kafka.common.TopicTest > testInvalidTopicNames PASSED

kafka.common.TopicTest > testTopicHasCollision PASSED

kafka.common.TopicTest > testTopicHasCollisionChars PASSED

kafka.api.ConsumerTest > testSimpleConsumption PASSED

kafka.api.ProducerFailureHandlingTest > testTooLargeRecordWithAckZero PASSED

kafka.api.ProducerFailureHandlingTest > testNotEnoughReplicasAfterBrokerShutdown PASSED

kafka.utils.UtilsTest > testAbs PASSED

kafka.utils.UtilsTest > testReplaceSuffix PASSED

kafka.api.ConsumerTest > testPartitionPauseAndResume PASSED

kafka.utils.UtilsTest > testDoublyLinkedList PASSED

kafka.utils.UtilsTest > testCircularIterator PASSED

kafka.utils.UtilsTest > testReadBytes PASSED

kafka.utils.UtilsTest > testCsvList PASSED

kafka.utils.UtilsTest > testReadInt PASSED

kafka.utils.UtilsTest > testCsvMap PASSED

kafka.utils.UtilsTest > testInLock PASSED

kafka.utils.UtilsTest > testSwallow PASSED

kafka.integration.UncleanLeaderElectionTest > testUncleanLeaderElectionDisabled PASSED

kafka.log.LogCleanerIntegrationTest > cleanerTest[2] PASSED

kafka.integration.UncleanLeaderElectionTest > testUncleanLeaderElectionInvalidTopicOverride
PASSED

kafka.api.ConsumerTest > testPartitionReassignmentCallback PASSED

kafka.integration.UncleanLeaderElectionTest > testUncleanLeaderElectionEnabledByTopicOverride
PASSED

kafka.zk.ZKPathTest > testCreatePersistentSequentialThrowsException PASSED

kafka.zk.ZKPathTest > testCreatePersistentSequentialExists PASSED

kafka.zk.ZKPathTest > testCreateEphemeralPathExists PASSED

kafka.zk.ZKPathTest > testCreatePersistentPath PASSED

kafka.zk.ZKPathTest > testMakeSurePersistsPathExistsThrowsException PASSED

kafka.zk.ZKPathTest > testCreateEphemeralPathThrowsException PASSED

kafka.zk.ZKPathTest > testCreatePersistentPathThrowsException PASSED

kafka.zk.ZKPathTest > testMakeSurePersistsPathExists PASSED

kafka.api.ConsumerTest > testAutoOffsetReset PASSED

kafka.api.ConsumerTest > testCommitSpecifiedOffsets PASSED

kafka.log.LogCleanerIntegrationTest > cleanerTest[3] PASSED

kafka.api.ConsumerTest > testCommitMetadata PASSED

kafka.log.LogManagerTest > testCleanupExpiredSegments PASSED

kafka.log.LogManagerTest > testCheckpointRecoveryPoints PASSED

kafka.log.LogManagerTest > testTimeBasedFlush PASSED

kafka.log.LogManagerTest > testCreateLog PASSED

kafka.log.LogManagerTest > testRecoveryDirectoryMappingWithTrailingSlash PASSED

kafka.api.SSLConsumerTest > testSeek PASSED

kafka.api.SSLProducerSendTest > testClose PASSED

kafka.api.ConsumerTest > testPatternSubscription PASSED

kafka.utils.SchedulerTest > testMockSchedulerNonPeriodicTask PASSED

kafka.utils.SchedulerTest > testMockSchedulerPeriodicTask PASSED

kafka.utils.SchedulerTest > testNonPeriodicTask PASSED

kafka.utils.SchedulerTest > testRestart PASSED

kafka.utils.SchedulerTest > testReentrantTaskInMockScheduler PASSED

kafka.utils.SchedulerTest > testPeriodicTask PASSED

kafka.api.SSLProducerSendTest > testSendToPartition PASSED

kafka.api.SSLProducerSendTest > testSendOffset PASSED

kafka.utils.CommandLineUtilsTest > testParseEmptyArg PASSED

kafka.utils.CommandLineUtilsTest > testParseSingleArg PASSED

kafka.utils.CommandLineUtilsTest > testParseArgs PASSED

kafka.api.SSLConsumerTest > testPositionAndCommit PASSED

kafka.api.SSLConsumerTest > testGroupConsumption PASSED

kafka.api.SSLConsumerTest > testPartitionsFor PASSED

kafka.api.SSLConsumerTest > testSimpleConsumption PASSED

kafka.api.SSLConsumerTest > testAutoOffsetReset PASSED

kafka.utils.timer.TimerTest > testAlreadyExpiredTask PASSED

kafka.utils.timer.TimerTest > testTaskExpiration PASSED

546 tests completed, 2 failed
:core:test FAILED

FAILURE: Build failed with an exception.

* What went wrong:
Execution failed for task ':core:test'.
> There were failing tests. See the report at: file:///x1/jenkins/jenkins-slave/workspace/Kafka-trunk/core/build/reports/tests/index.html

* Try:
Run with --stacktrace option to get the stack trace. Run with --info or --debug option to
get more log output.

BUILD FAILED

Total time: 4 mins 43.919 secs
Build step 'Execute shell' marked build as failure
Setting GRADLE_2_1_HOME=/home/jenkins/jenkins-slave/tools/hudson.plugins.gradle.GradleInstallation/Gradle_2.1

Mime
View raw message