kafka-dev mailing list archives

Site index · List index
Message view « Date » · « Thread »
Top « Date » · « Thread »
From Apache Jenkins Server <jenk...@builds.apache.org>
Subject Build failed in Jenkins: kafka-trunk-jdk8 #5
Date Tue, 06 Oct 2015 23:36:54 GMT
See <https://builds.apache.org/job/kafka-trunk-jdk8/5/changes>

Changes:

[wangguoz] KAFKA-2474: Add caching of JSON schema conversions to JsonConverter

------------------------------------------
[...truncated 6513 lines...]
org.apache.kafka.copycat.data.SchemaBuilderTest > testBooleanBuilder PASSED

org.apache.kafka.copycat.data.SchemaBuilderTest > testDoubleBuilder PASSED

org.apache.kafka.copycat.connector.ConnectorReconfigurationTest > testReconfigureStopException
PASSED

org.apache.kafka.copycat.connector.ConnectorReconfigurationTest > testDefaultReconfigure
PASSED

org.apache.kafka.copycat.data.FieldTest > testEquality PASSED
:copycat:file:checkstyleMain
:copycat:file:compileTestJava
Download https://repo1.maven.org/maven2/org/powermock/powermock-module-junit4/1.6.2/powermock-module-junit4-1.6.2.pom
Download https://repo1.maven.org/maven2/org/powermock/powermock-modules/1.6.2/powermock-modules-1.6.2.pom
Download https://repo1.maven.org/maven2/org/powermock/powermock/1.6.2/powermock-1.6.2.pom
Download https://repo1.maven.org/maven2/org/powermock/powermock-api-easymock/1.6.2/powermock-api-easymock-1.6.2.pom
Download https://repo1.maven.org/maven2/org/powermock/powermock-api/1.6.2/powermock-api-1.6.2.pom
Download https://repo1.maven.org/maven2/org/powermock/powermock-module-junit4-common/1.6.2/powermock-module-junit4-common-1.6.2.pom
Download https://repo1.maven.org/maven2/cglib/cglib-nodep/2.2.2/cglib-nodep-2.2.2.pom
Download https://repo1.maven.org/maven2/org/powermock/powermock-api-support/1.6.2/powermock-api-support-1.6.2.pom
Download https://repo1.maven.org/maven2/org/powermock/powermock-core/1.6.2/powermock-core-1.6.2.pom
Download https://repo1.maven.org/maven2/org/powermock/powermock-reflect/1.6.2/powermock-reflect-1.6.2.pom
Download https://repo1.maven.org/maven2/org/javassist/javassist/3.19.0-GA/javassist-3.19.0-GA.pom
Download https://repo1.maven.org/maven2/junit/junit/4.12/junit-4.12.pom
Download https://repo1.maven.org/maven2/org/powermock/powermock-module-junit4/1.6.2/powermock-module-junit4-1.6.2.jar
Download https://repo1.maven.org/maven2/org/powermock/powermock-api-easymock/1.6.2/powermock-api-easymock-1.6.2.jar
Download https://repo1.maven.org/maven2/org/powermock/powermock-module-junit4-common/1.6.2/powermock-module-junit4-common-1.6.2.jar
Download https://repo1.maven.org/maven2/cglib/cglib-nodep/2.2.2/cglib-nodep-2.2.2.jar
Download https://repo1.maven.org/maven2/org/powermock/powermock-api-support/1.6.2/powermock-api-support-1.6.2.jar
Download https://repo1.maven.org/maven2/org/powermock/powermock-core/1.6.2/powermock-core-1.6.2.jar
Download https://repo1.maven.org/maven2/org/powermock/powermock-reflect/1.6.2/powermock-reflect-1.6.2.jar
Download https://repo1.maven.org/maven2/org/javassist/javassist/3.19.0-GA/javassist-3.19.0-GA.jar
Download https://repo1.maven.org/maven2/junit/junit/4.12/junit-4.12.jar
warning: [options] bootstrap class path not set in conjunction with -source 1.7
Note: <https://builds.apache.org/job/kafka-trunk-jdk8/ws/copycat/file/src/test/java/org/apache/kafka/copycat/file/FileStreamSourceTaskTest.java>
uses unchecked or unsafe operations.
Note: Recompile with -Xlint:unchecked for details.
1 warning
:copycat:file:processTestResources UP-TO-DATE
:copycat:file:testClasses
:copycat:file:checkstyleTest
:copycat:file:test

org.apache.kafka.copycat.file.FileStreamSourceConnectorTest > testSourceTasks PASSED

org.apache.kafka.copycat.file.FileStreamSourceConnectorTest > testSourceTasksStdin PASSED

org.apache.kafka.copycat.file.FileStreamSourceConnectorTest > testTaskClass PASSED

org.apache.kafka.copycat.file.FileStreamSourceConnectorTest > testMultipleSourcesInvalid
PASSED

org.apache.kafka.copycat.file.FileStreamSinkTaskTest > testPutFlush PASSED

org.apache.kafka.copycat.file.FileStreamSinkConnectorTest > testSinkTasks PASSED

org.apache.kafka.copycat.file.FileStreamSinkConnectorTest > testTaskClass PASSED

org.apache.kafka.copycat.file.FileStreamSourceTaskTest > testNormalLifecycle PASSED

org.apache.kafka.copycat.file.FileStreamSourceTaskTest > testMissingTopic PASSED
:copycat:json:checkstyleMain
:copycat:json:compileTestJavawarning: [options] bootstrap class path not set in conjunction
with -source 1.7
Note: <https://builds.apache.org/job/kafka-trunk-jdk8/ws/copycat/json/src/test/java/org/apache/kafka/copycat/json/JsonConverterTest.java>
uses unchecked or unsafe operations.
Note: Recompile with -Xlint:unchecked for details.
1 warning

:copycat:json:processTestResources UP-TO-DATE
:copycat:json:testClasses
:copycat:json:checkstyleTest
:copycat:json:test

org.apache.kafka.copycat.json.JsonConverterTest > longToCopycat PASSED

org.apache.kafka.copycat.json.JsonConverterTest > testCacheSchemaToJsonConversion PASSED

org.apache.kafka.copycat.json.JsonConverterTest > nullSchemaAndMapNonStringKeysToJson PASSED

org.apache.kafka.copycat.json.JsonConverterTest > floatToJson PASSED

org.apache.kafka.copycat.json.JsonConverterTest > booleanToCopycat PASSED

org.apache.kafka.copycat.json.JsonConverterTest > nullSchemaAndMapToJson PASSED

org.apache.kafka.copycat.json.JsonConverterTest > stringToCopycat PASSED

org.apache.kafka.copycat.json.JsonConverterTest > testCopycatSchemaMetadataTranslation
PASSED

org.apache.kafka.copycat.json.JsonConverterTest > mapToCopycatStringKeys PASSED

org.apache.kafka.copycat.json.JsonConverterTest > mapToJsonNonStringKeys PASSED

org.apache.kafka.copycat.json.JsonConverterTest > longToJson PASSED

org.apache.kafka.copycat.json.JsonConverterTest > mismatchSchemaJson PASSED

org.apache.kafka.copycat.json.JsonConverterTest > testCacheSchemaToCopycatConversion PASSED

org.apache.kafka.copycat.json.JsonConverterTest > testJsonSchemaMetadataTranslation PASSED

org.apache.kafka.copycat.json.JsonConverterTest > bytesToJson PASSED

org.apache.kafka.copycat.json.JsonConverterTest > shortToCopycat PASSED

org.apache.kafka.copycat.json.JsonConverterTest > intToJson PASSED

org.apache.kafka.copycat.json.JsonConverterTest > structToCopycat PASSED

org.apache.kafka.copycat.json.JsonConverterTest > stringToJson PASSED

org.apache.kafka.copycat.json.JsonConverterTest > nullSchemaAndArrayToJson PASSED

org.apache.kafka.copycat.json.JsonConverterTest > byteToCopycat PASSED

org.apache.kafka.copycat.json.JsonConverterTest > nullSchemaPrimitiveToCopycat PASSED

org.apache.kafka.copycat.json.JsonConverterTest > byteToJson PASSED

org.apache.kafka.copycat.json.JsonConverterTest > intToCopycat PASSED

org.apache.kafka.copycat.json.JsonConverterTest > noSchemaToCopycat PASSED

org.apache.kafka.copycat.json.JsonConverterTest > noSchemaToJson PASSED

org.apache.kafka.copycat.json.JsonConverterTest > nullSchemaAndPrimitiveToJson PASSED

org.apache.kafka.copycat.json.JsonConverterTest > mapToJsonStringKeys PASSED

org.apache.kafka.copycat.json.JsonConverterTest > arrayToJson PASSED

org.apache.kafka.copycat.json.JsonConverterTest > nullToCopycat PASSED

org.apache.kafka.copycat.json.JsonConverterTest > structToJson PASSED

org.apache.kafka.copycat.json.JsonConverterTest > shortToJson PASSED

org.apache.kafka.copycat.json.JsonConverterTest > doubleToJson PASSED

org.apache.kafka.copycat.json.JsonConverterTest > floatToCopycat PASSED

org.apache.kafka.copycat.json.JsonConverterTest > arrayToCopycat PASSED

org.apache.kafka.copycat.json.JsonConverterTest > booleanToJson PASSED

org.apache.kafka.copycat.json.JsonConverterTest > mapToCopycatNonStringKeys PASSED

org.apache.kafka.copycat.json.JsonConverterTest > bytesToCopycat PASSED

org.apache.kafka.copycat.json.JsonConverterTest > doubleToCopycat PASSED
:copycat:runtime:checkstyleMain
:copycat:runtime:compileTestJavawarning: [options] bootstrap class path not set in conjunction
with -source 1.7
Note: Some input files use unchecked or unsafe operations.
Note: Recompile with -Xlint:unchecked for details.
1 warning

:copycat:runtime:processTestResources
:copycat:runtime:testClasses
:copycat:runtime:checkstyleTest
:copycat:runtime:test

org.apache.kafka.copycat.runtime.WorkerSourceTaskTest > testPollsInBackground PASSED

org.apache.kafka.copycat.runtime.WorkerSourceTaskTest > testCommit PASSED

org.apache.kafka.copycat.runtime.WorkerSourceTaskTest > testCommitFailure PASSED

org.apache.kafka.copycat.runtime.WorkerSourceTaskTest > testSendRecordsConvertsData PASSED

org.apache.kafka.copycat.runtime.standalone.StandaloneHerderTest > testCreateSinkConnector
PASSED

org.apache.kafka.copycat.runtime.standalone.StandaloneHerderTest > testDestroyConnector
PASSED

org.apache.kafka.copycat.runtime.standalone.StandaloneHerderTest > testCreateSourceConnector
PASSED

org.apache.kafka.copycat.storage.FileOffsetBackingStoreTest > testSaveRestore PASSED

org.apache.kafka.copycat.storage.FileOffsetBackingStoreTest > testGetSet PASSED

org.apache.kafka.copycat.runtime.WorkerSinkTaskTest > testPollsInBackground PASSED

org.apache.kafka.copycat.runtime.WorkerSinkTaskTest > testDeliverConvertsData PASSED

org.apache.kafka.copycat.runtime.WorkerSinkTaskTest > testCommit PASSED

org.apache.kafka.copycat.runtime.WorkerSinkTaskTest > testCommitTaskFlushFailure PASSED

org.apache.kafka.copycat.runtime.WorkerSinkTaskTest > testCommitConsumerFailure PASSED

org.apache.kafka.copycat.runtime.WorkerSinkTaskTest > testCommitTimeout PASSED

org.apache.kafka.copycat.runtime.WorkerSinkTaskTest > testAssignmentPauseResume PASSED

org.apache.kafka.copycat.runtime.WorkerTest > testStopInvalidTask PASSED

org.apache.kafka.copycat.util.ShutdownableThreadTest > testGracefulShutdown PASSED

org.apache.kafka.copycat.util.ShutdownableThreadTest > testForcibleShutdown PASSED

org.apache.kafka.copycat.runtime.WorkerTest > testAddRemoveTask PASSED

org.apache.kafka.copycat.runtime.WorkerTest > testCleanupTasksOnStop PASSED

org.apache.kafka.copycat.storage.KafkaOffsetBackingStoreTest > testConsumerError PASSED

org.apache.kafka.copycat.storage.KafkaOffsetBackingStoreTest > testProducerError PASSED

org.apache.kafka.copycat.storage.KafkaOffsetBackingStoreTest > testMissingTopic PASSED

org.apache.kafka.copycat.storage.KafkaOffsetBackingStoreTest > testStartStop PASSED

org.apache.kafka.copycat.storage.KafkaOffsetBackingStoreTest > testReloadOnStart PASSED

org.apache.kafka.copycat.storage.OffsetStorageWriterTest > testWriteFlush PASSED

org.apache.kafka.copycat.storage.OffsetStorageWriterTest > testNoOffsetsToFlush PASSED

org.apache.kafka.copycat.storage.OffsetStorageWriterTest > testFlushFailureReplacesOffsets
PASSED

org.apache.kafka.copycat.storage.OffsetStorageWriterTest > testAlreadyFlushing PASSED

org.apache.kafka.copycat.storage.OffsetStorageWriterTest > testCancelBeforeAwaitFlush PASSED

org.apache.kafka.copycat.storage.OffsetStorageWriterTest > testCancelAfterAwaitFlush PASSED

org.apache.kafka.copycat.storage.KafkaOffsetBackingStoreTest > testGetSet FAILED
    java.lang.AssertionError
        at org.junit.Assert.fail(Assert.java:86)
        at org.junit.Assert.assertTrue(Assert.java:41)
        at org.junit.Assert.assertTrue(Assert.java:52)
        at org.apache.kafka.copycat.storage.KafkaOffsetBackingStoreTest.testGetSet(KafkaOffsetBackingStoreTest.java:308)

33 tests completed, 1 failed
:copycat:runtime:test FAILED

FAILURE: Build failed with an exception.

* What went wrong:
Execution failed for task ':copycat:runtime:test'.
> There were failing tests. See the report at: file://<https://builds.apache.org/job/kafka-trunk-jdk8/ws/copycat/runtime/build/reports/tests/index.html>

* Try:
Run with --stacktrace option to get the stack trace. Run with --info or --debug option to
get more log output.

BUILD FAILED

Total time: 23 mins 4.847 secs
Build step 'Execute shell' marked build as failure
Recording test results
Setting GRADLE_2_1_HOME=/jenkins/tools/hudson.plugins.gradle.GradleInstallation/Gradle_2.1
Setting JDK1_8_0_45_HOME=/jenkins/tools/hudson.model.JDK/jdk1.8.0_45
Setting GRADLE_2_1_HOME=/jenkins/tools/hudson.plugins.gradle.GradleInstallation/Gradle_2.1
Setting JDK1_8_0_45_HOME=/jenkins/tools/hudson.model.JDK/jdk1.8.0_45

Mime
View raw message