kafka-commits mailing list archives

Site index · List index
Message view « Date » · « Thread »
Top « Date » · « Thread »
From Apache Jenkins Server <jenk...@builds.apache.org>
Subject Build failed in Jenkins: Kafka-0.8 #21
Date Wed, 15 Aug 2012 16:16:19 GMT
See <https://builds.apache.org/job/Kafka-0.8/21/changes>

Changes:

[junrao] KafkaController.RequestSendThread can throw exception on broker socket; patched by
Yang Ye; reviewed by Jun Rao; KAFKA-459, KAFKA-460

------------------------------------------
[...truncated 964 lines...]
[info] Test Starting: testFileSize
[info] Test Passed: testFileSize
[info] Test Starting: testIterationOverPartialAndTruncation
[info] Test Passed: testIterationOverPartialAndTruncation
[info] Test Starting: testIterationDoesntChangePosition
[info] Test Passed: testIterationDoesntChangePosition
[info] Test Starting: testRead
[info] Test Passed: testRead
[info] == core-kafka / kafka.message.FileMessageSetTest ==
[info] 
[info] == core-kafka / kafka.server.LogRecoveryTest ==
[info] Test Starting: testHWCheckpointNoFailuresSingleLogSegment(kafka.server.LogRecoveryTest)
[info] Test Passed: testHWCheckpointNoFailuresSingleLogSegment(kafka.server.LogRecoveryTest)
[info] Test Starting: testHWCheckpointWithFailuresSingleLogSegment(kafka.server.LogRecoveryTest)
[info] Test Passed: testHWCheckpointWithFailuresSingleLogSegment(kafka.server.LogRecoveryTest)
[info] Test Starting: testHWCheckpointNoFailuresMultipleLogSegments(kafka.server.LogRecoveryTest)
[info] Test Passed: testHWCheckpointNoFailuresMultipleLogSegments(kafka.server.LogRecoveryTest)
[info] Test Starting: testHWCheckpointWithFailuresMultipleLogSegments(kafka.server.LogRecoveryTest)
[info] Test Passed: testHWCheckpointWithFailuresMultipleLogSegments(kafka.server.LogRecoveryTest)
[info] == core-kafka / kafka.server.LogRecoveryTest ==
[info] 
[info] == core-kafka / kafka.integration.TopicMetadataTest ==
[info] Test Starting: testTopicMetadataRequest(kafka.integration.TopicMetadataTest)
[info] Test Passed: testTopicMetadataRequest(kafka.integration.TopicMetadataTest)
[info] Test Starting: testBasicTopicMetadata(kafka.integration.TopicMetadataTest)
[info] Test Passed: testBasicTopicMetadata(kafka.integration.TopicMetadataTest)
[info] Test Starting: testAutoCreateTopic(kafka.integration.TopicMetadataTest)
[info] Test Passed: testAutoCreateTopic(kafka.integration.TopicMetadataTest)
[info] == core-kafka / kafka.integration.TopicMetadataTest ==
[info] 
[info] == core-kafka / kafka.integration.LazyInitProducerTest ==
[info] Test Starting: testProduceAndMultiFetch(kafka.integration.LazyInitProducerTest)
[info] Test Passed: testProduceAndMultiFetch(kafka.integration.LazyInitProducerTest)
[info] Test Starting: testMultiProduce(kafka.integration.LazyInitProducerTest)
[info] Test Passed: testMultiProduce(kafka.integration.LazyInitProducerTest)
[info] Test Starting: testProduceAndFetch(kafka.integration.LazyInitProducerTest)
[info] Test Passed: testProduceAndFetch(kafka.integration.LazyInitProducerTest)
[info] Test Starting: testMultiProduceResend(kafka.integration.LazyInitProducerTest)
[info] Test Passed: testMultiProduceResend(kafka.integration.LazyInitProducerTest)
[info] == core-kafka / kafka.integration.LazyInitProducerTest ==
[info] 
[info] == core-kafka / kafka.server.ServerShutdownTest ==
[info] Test Starting: testCleanShutdown(kafka.server.ServerShutdownTest)
[info] Test Passed: testCleanShutdown(kafka.server.ServerShutdownTest)
[info] == core-kafka / kafka.server.ServerShutdownTest ==
[info] 
[info] == core-kafka / kafka.server.ReplicaFetchTest ==
[info] Test Starting: testReplicaFetcherThread(kafka.server.ReplicaFetchTest)
[info] Test Passed: testReplicaFetcherThread(kafka.server.ReplicaFetchTest)
[info] == core-kafka / kafka.server.ReplicaFetchTest ==
[info] 
[info] == core-kafka / kafka.log.LogTest ==
[info] Test Starting: testLoadEmptyLog
[info] Test Passed: testLoadEmptyLog
[info] Test Starting: testLoadInvalidLogsFails
[info] Test Passed: testLoadInvalidLogsFails
[info] Test Starting: testAppendAndRead
[info] Test Passed: testAppendAndRead
[info] Test Starting: testReadOutOfRange
[info] Test Passed: testReadOutOfRange
[info] Test Starting: testLogRolls
[info] Test Passed: testLogRolls
[info] Test Starting: testFindSegment
[info] Test Passed: testFindSegment
[info] Test Starting: testEdgeLogRolls
[info] Test Passed: testEdgeLogRolls
[info] == core-kafka / kafka.log.LogTest ==
[info] 
[info] == core-kafka / kafka.log.SegmentListTest ==
[info] Test Starting: testAppend
[info] Test Passed: testAppend
[info] Test Starting: testTrunc
[info] Test Passed: testTrunc
[info] Test Starting: testTruncLast
[info] Test Passed: testTruncLast
[info] Test Starting: testTruncBeyondList
[info] Test Passed: testTruncBeyondList
[info] == core-kafka / kafka.log.SegmentListTest ==
[info] 
[info] == core-kafka / kafka.utils.UtilsTest ==
[info] Test Starting: testSwallow
[info] Test Passed: testSwallow
[info] Test Starting: testCircularIterator
[info] Test Passed: testCircularIterator
[info] == core-kafka / kafka.utils.UtilsTest ==
[info] 
[info] == core-kafka / kafka.message.CompressionUtilTest ==
[info] Test Starting: testSimpleCompressDecompress
[info] Test Passed: testSimpleCompressDecompress
[info] Test Starting: testComplexCompressDecompress
[info] Test Passed: testComplexCompressDecompress
[info] Test Starting: testSnappyCompressDecompressExplicit
java.lang.reflect.InvocationTargetException
	at sun.reflect.NativeMethodAccessorImpl.invoke0(Native Method)
	at sun.reflect.NativeMethodAccessorImpl.invoke(NativeMethodAccessorImpl.java:39)
	at sun.reflect.DelegatingMethodAccessorImpl.invoke(DelegatingMethodAccessorImpl.java:25)
	at java.lang.reflect.Method.invoke(Method.java:597)
	at org.xerial.snappy.SnappyLoader.loadNativeLibrary(SnappyLoader.java:317)
	at org.xerial.snappy.SnappyLoader.load(SnappyLoader.java:219)
	at org.xerial.snappy.Snappy.<clinit>(Snappy.java:44)
	at org.xerial.snappy.SnappyOutputStream.<init>(SnappyOutputStream.java:79)
	at org.xerial.snappy.SnappyOutputStream.<init>(SnappyOutputStream.java:66)
	at kafka.message.SnappyCompression.<init>(CompressionUtils.scala:61)
	at kafka.message.CompressionFactory$.apply(CompressionUtils.scala:82)
	at kafka.message.CompressionUtils$.compress(CompressionUtils.scala:109)
	at kafka.message.CompressionUtilTest.testSnappyCompressDecompressExplicit(CompressionUtilsTest.scala:65)
	at sun.reflect.NativeMethodAccessorImpl.invoke0(Native Method)
	at sun.reflect.NativeMethodAccessorImpl.invoke(NativeMethodAccessorImpl.java:39)
	at sun.reflect.DelegatingMethodAccessorImpl.invoke(DelegatingMethodAccessorImpl.java:25)
	at java.lang.reflect.Method.invoke(Method.java:597)
	at org.junit.internal.runners.TestMethodRunner.executeMethodBody(TestMethodRunner.java:99)
	at org.junit.internal.runners.TestMethodRunner.runUnprotected(TestMethodRunner.java:81)
	at org.junit.internal.runners.BeforeAndAfterRunner.runProtected(BeforeAndAfterRunner.java:34)
	at org.junit.internal.runners.TestMethodRunner.runMethod(TestMethodRunner.java:75)
	at org.junit.internal.runners.TestMethodRunner.run(TestMethodRunner.java:45)
	at org.junit.internal.runners.TestClassMethodsRunner.invokeTestMethod(TestClassMethodsRunner.java:71)
	at org.junit.internal.runners.TestClassMethodsRunner.run(TestClassMethodsRunner.java:35)
	at org.junit.internal.runners.TestClassRunner$1.runUnprotected(TestClassRunner.java:42)
	at org.junit.internal.runners.BeforeAndAfterRunner.runProtected(BeforeAndAfterRunner.java:34)
	at org.junit.internal.runners.TestClassRunner.run(TestClassRunner.java:52)
	at org.junit.internal.runners.CompositeRunner.run(CompositeRunner.java:29)
	at org.junit.runner.JUnitCore.run(JUnitCore.java:121)
	at org.junit.runner.JUnitCore.run(JUnitCore.java:100)
	at org.junit.runner.JUnitCore.run(JUnitCore.java:91)
	at org.scalatest.junit.JUnitSuite$class.run(JUnitSuite.scala:261)
	at kafka.message.CompressionUtilTest.run(CompressionUtilsTest.scala:25)
	at org.scalatest.tools.ScalaTestFramework$ScalaTestRunner.run(ScalaTestFramework.scala:40)
	at sbt.TestRunner.run(TestFramework.scala:53)
	at sbt.TestRunner.runTest$1(TestFramework.scala:67)
	at sbt.TestRunner.run(TestFramework.scala:76)
	at sbt.TestFramework$$anonfun$10$$anonfun$apply$11.runTest$2(TestFramework.scala:194)
	at sbt.TestFramework$$anonfun$10$$anonfun$apply$11$$anonfun$apply$12.apply(TestFramework.scala:205)
	at sbt.TestFramework$$anonfun$10$$anonfun$apply$11$$anonfun$apply$12.apply(TestFramework.scala:205)
	at sbt.NamedTestTask.run(TestFramework.scala:92)
	at sbt.ScalaProject$$anonfun$sbt$ScalaProject$$toTask$1.apply(ScalaProject.scala:193)
	at sbt.ScalaProject$$anonfun$sbt$ScalaProject$$toTask$1.apply(ScalaProject.scala:193)
	at sbt.TaskManager$Task.invoke(TaskManager.scala:62)
	at sbt.impl.RunTask.doRun$1(RunTask.scala:77)
	at sbt.impl.RunTask.runTask(RunTask.scala:85)
	at sbt.impl.RunTask.sbt$impl$RunTask$$runIfNotRoot(RunTask.scala:60)
	at sbt.impl.RunTask$$anonfun$runTasksExceptRoot$2.apply(RunTask.scala:48)
	at sbt.impl.RunTask$$anonfun$runTasksExceptRoot$2.apply(RunTask.scala:48)
	at sbt.Distributor$Run$Worker$$anonfun$2.apply(ParallelRunner.scala:131)
	at sbt.Distributor$Run$Worker$$anonfun$2.apply(ParallelRunner.scala:131)
	at sbt.Control$.trapUnit(Control.scala:19)
	at sbt.Distributor$Run$Worker.run(ParallelRunner.scala:131)
Caused by: java.lang.UnsatisfiedLinkError: no snappyjava in java.library.path
	at java.lang.ClassLoader.loadLibrary(ClassLoader.java:1734)
	at java.lang.Runtime.loadLibrary0(Runtime.java:823)
	at java.lang.System.loadLibrary(System.java:1028)
	at org.xerial.snappy.SnappyNativeLoader.loadLibrary(SnappyNativeLoader.java:52)
	... 53 more
[error] Test Failed: testSnappyCompressDecompressExplicit
org.xerial.snappy.SnappyError: [FAILED_TO_LOAD_NATIVE_LIBRARY] null
	at org.xerial.snappy.SnappyLoader.load(SnappyLoader.java:229)
	at org.xerial.snappy.Snappy.<clinit>(Snappy.java:44)
	at org.xerial.snappy.SnappyOutputStream.<init>(SnappyOutputStream.java:79)
	at org.xerial.snappy.SnappyOutputStream.<init>(SnappyOutputStream.java:66)
	at kafka.message.SnappyCompression.<init>(CompressionUtils.scala:61)
	at kafka.message.CompressionFactory$.apply(CompressionUtils.scala:82)
	at kafka.message.CompressionUtils$.compress(CompressionUtils.scala:109)
	at kafka.message.CompressionUtilTest.testSnappyCompressDecompressExplicit(CompressionUtilsTest.scala:65)
	at sun.reflect.NativeMethodAccessorImpl.invoke0(Native Method)
	at sun.reflect.NativeMethodAccessorImpl.invoke(NativeMethodAccessorImpl.java:39)
	at sun.reflect.DelegatingMethodAccessorImpl.invoke(DelegatingMethodAccessorImpl.java:25)
	at java.lang.reflect.Method.invoke(Method.java:597)
	at org.junit.internal.runners.TestMethodRunner.executeMethodBody(TestMethodRunner.java:99)
	at org.junit.internal.runners.TestMethodRunner.runUnprotected(TestMethodRunner.java:81)
	at org.junit.internal.runners.BeforeAndAfterRunner.runProtected(BeforeAndAfterRunner.java:34)
	at org.junit.internal.runners.TestMethodRunner.runMethod(TestMethodRunner.java:75)
	at org.junit.internal.runners.TestMethodRunner.run(TestMethodRunner.java:45)
	at org.junit.internal.runners.TestClassMethodsRunner.invokeTestMethod(TestClassMethodsRunner.java:71)
	at org.junit.internal.runners.TestClassMethodsRunner.run(TestClassMethodsRunner.java:35)
	at org.junit.internal.runners.TestClassRunner$1.runUnprotected(TestClassRunner.java:42)
	at org.junit.internal.runners.BeforeAndAfterRunner.runProtected(BeforeAndAfterRunner.java:34)
	at org.junit.internal.runners.TestClassRunner.run(TestClassRunner.java:52)
	at org.junit.internal.runners.CompositeRunner.run(CompositeRunner.java:29)
	at org.junit.runner.JUnitCore.run(JUnitCore.java:121)
	at org.junit.runner.JUnitCore.run(JUnitCore.java:100)
	at org.junit.runner.JUnitCore.run(JUnitCore.java:91)
	at org.scalatest.junit.JUnitSuite$class.run(JUnitSuite.scala:261)
	at kafka.message.CompressionUtilTest.run(CompressionUtilsTest.scala:25)
	at org.scalatest.tools.ScalaTestFramework$ScalaTestRunner.run(ScalaTestFramework.scala:40)
	at sbt.TestRunner.run(TestFramework.scala:53)
	at sbt.TestRunner.runTest$1(TestFramework.scala:67)
	at sbt.TestRunner.run(TestFramework.scala:76)
	at sbt.TestFramework$$anonfun$10$$anonfun$apply$11.runTest$2(TestFramework.scala:194)
	at sbt.TestFramework$$anonfun$10$$anonfun$apply$11$$anonfun$apply$12.apply(TestFramework.scala:205)
	at sbt.TestFramework$$anonfun$10$$anonfun$apply$11$$anonfun$apply$12.apply(TestFramework.scala:205)
	at sbt.NamedTestTask.run(TestFramework.scala:92)
	at sbt.ScalaProject$$anonfun$sbt$ScalaProject$$toTask$1.apply(ScalaProject.scala:193)
	at sbt.ScalaProject$$anonfun$sbt$ScalaProject$$toTask$1.apply(ScalaProject.scala:193)
	at sbt.TaskManager$Task.invoke(TaskManager.scala:62)
	at sbt.impl.RunTask.doRun$1(RunTask.scala:77)
	at sbt.impl.RunTask.runTask(RunTask.scala:85)
	at sbt.impl.RunTask.sbt$impl$RunTask$$runIfNotRoot(RunTask.scala:60)
	at sbt.impl.RunTask$$anonfun$runTasksExceptRoot$2.apply(RunTask.scala:48)
	at sbt.impl.RunTask$$anonfun$runTasksExceptRoot$2.apply(RunTask.scala:48)
	at sbt.Distributor$Run$Worker$$anonfun$2.apply(ParallelRunner.scala:131)
	at sbt.Distributor$Run$Worker$$anonfun$2.apply(ParallelRunner.scala:131)
	at sbt.Control$.trapUnit(Control.scala:19)
	at sbt.Distributor$Run$Worker.run(ParallelRunner.scala:131)
[info] == core-kafka / kafka.message.CompressionUtilTest ==
[info] 
[info] == core-kafka / kafka.message.MessageTest ==
[info] Test Starting: testFieldValues
[info] Test Passed: testFieldValues
[info] Test Starting: testChecksum
[info] Test Passed: testChecksum
[info] Test Starting: testEquality
[info] Test Passed: testEquality
[info] Test Starting: testIsHashable
[info] Test Passed: testIsHashable
[info] == core-kafka / kafka.message.MessageTest ==
[info] 
[info] == core-kafka / kafka.server.HighwatermarkPersistenceTest ==
[info] Test Starting: testHighWatermarkPersistenceSinglePartition(kafka.server.HighwatermarkPersistenceTest)
[info] Test Passed: testHighWatermarkPersistenceSinglePartition(kafka.server.HighwatermarkPersistenceTest)
[info] Test Starting: testHighWatermarkPersistenceMultiplePartitions(kafka.server.HighwatermarkPersistenceTest)
[info] Test Passed: testHighWatermarkPersistenceMultiplePartitions(kafka.server.HighwatermarkPersistenceTest)
[info] == core-kafka / kafka.server.HighwatermarkPersistenceTest ==
[info] 
[info] == core-kafka / test-finish ==
[error] Failed: : Total 137, Failed 3, Errors 0, Passed 134, Skipped 0
[info] == core-kafka / test-finish ==
[info] 
[info] == core-kafka / Test cleanup 1 ==
[info] Deleting directory /var/tmp/sbt_510e5050
[info] == core-kafka / Test cleanup 1 ==
[info] 
[info] == core-kafka / test-cleanup ==
[info] == core-kafka / test-cleanup ==
[info] 
[info] == perf / test-compile ==
[info]   Source analysis: 0 new/modified, 0 indirectly invalidated, 0 removed.
[info] Compiling test sources...
[info] Nothing to compile.
[info]   Post-analysis: 0 classes.
[info] == perf / test-compile ==
[error] Error running kafka.log.LogCorruptionTest: Test FAILED
[error] Error running kafka.log.LogOffsetTest: Test FAILED
[error] Error running kafka.message.CompressionUtilTest: Test FAILED
[error] Error running test: One or more subtasks failed
[info] 
[info] Total time: 441 s, completed Aug 15, 2012 4:16:29 PM
[info] 
[info] Total session time: 443 s, completed Aug 15, 2012 4:16:29 PM
[error] Error during build.
Build step 'Execute shell' marked build as failure

Mime
View raw message