juddi-dev mailing list archives

Site index · List index
Message view « Date » · « Thread »
Top « Date » · « Thread »
From Kurt T Stam <kurt.s...@gmail.com>
Subject Re: authinfo test fails
Date Mon, 15 Dec 2008 18:24:08 GMT
Hmm everything passes for me. Did you run a mvn clean install?

Jeff Faath wrote:
>
> The AuthInfoTest always fails for me with the error below.  I can't 
> get to any of the other tests because of it.  Any ideas?
>
>  
>
> -------------------------------------------------------------------------------
>
> Test set: _org_._uddi_.api_v3.AuthInfoTest
>
> -------------------------------------------------------------------------------
>
> Tests run: 4, Failures: 2, Errors: 0, Skipped: 0, Time elapsed: 1.516 
> _sec_ <<< FAILURE!
>
> _marshall_(_org_._uddi_.api_v3.AuthInfoTest)  Time elapsed: 0.656 
> _sec_  <<< FAILURE!
>
> _junit_.framework.ComparisonFailure: null expected:<<fragment 
> xmlns:ns[3="urn:uddi-org:api_v3" 
> xmlns:ns2="http://www.w3.org/2000/09/xmldsig#]">
>
>     <ns3:authInfo...> but was:<<fragment 
> xmlns:ns[2="http://www.w3.org/2000/09/xmldsig#" 
> xmlns:ns3="urn:uddi-org:api_v3]">
>
>     <ns3:authInfo...>
>
>       at _junit_.framework.Assert.assertEquals(Assert.java:81)
>
>       at _junit_.framework.Assert.assertEquals(Assert.java:87)
>
>       at _org_._uddi_.api_v3.AuthInfoTest._marshall_(AuthInfoTest.java:50)
>
>       at sun.reflect.NativeMethodAccessorImpl.invoke0(Native Method)
>
>       at 
> sun.reflect.NativeMethodAccessorImpl.invoke(NativeMethodAccessorImpl.java:39)
>
>       at 
> sun.reflect.DelegatingMethodAccessorImpl.invoke(DelegatingMethodAccessorImpl.java:25)
>
>       at java._lang_.reflect.Method.invoke(Method.java:597)
>
>       at 
> _org_._junit_.runners.model.FrameworkMethod$1.runReflectiveCall(FrameworkMethod.java:44)
>
>       at 
> _org_._junit_.internal.runners.model.ReflectiveCallable.run(ReflectiveCallable.java:15)
>
>       at 
> _org_._junit_.runners.model.FrameworkMethod.invokeExplosively(FrameworkMethod.java:41)
>
>       at 
> _org_._junit_.internal.runners.statements.InvokeMethod.evaluate(InvokeMethod.java:20)
>
>       at 
> _org_._junit_.internal.runners.statements.RunBefores.evaluate(RunBefores.java:28)
>
>       at 
> _org_._junit_.internal.runners.statements.RunAfters.evaluate(RunAfters.java:31)
>
>       at 
> _org_._junit_.runners.BlockJUnit4ClassRunner.runChild(BlockJUnit4ClassRunner.java:73)
>
>       at 
> _org_._junit_.runners.BlockJUnit4ClassRunner.runChild(BlockJUnit4ClassRunner.java:46)
>
>       at 
> _org_._junit_.runners.ParentRunner.runChildren(ParentRunner.java:180)
>
>       at 
> _org_._junit_.runners.ParentRunner.access$000(ParentRunner.java:41)
>
>       at 
> _org_._junit_.runners.ParentRunner$1.evaluate(ParentRunner.java:173)
>
>       at 
> _org_._junit_.internal.runners.statements.RunBefores.evaluate(RunBefores.java:28)
>
>       at 
> _org_._junit_.internal.runners.statements.RunAfters.evaluate(RunAfters.java:31)
>
>       at _org_._junit_.runners.ParentRunner.run(ParentRunner.java:220)
>
>       at 
> _org_._apache_._maven_._surefire_.junit4.JUnit4TestSet.execute(JUnit4TestSet.java:62)
>
>       at 
> _org_._apache_._maven_._surefire_.suite.AbstractDirectoryTestSuite.executeTestSet(AbstractDirectoryTestSuite.java:140)
>
>       at 
> _org_._apache_._maven_._surefire_.suite.AbstractDirectoryTestSuite.execute(AbstractDirectoryTestSuite.java:127)
>
>       at 
> _org_._apache_._maven_._surefire_._Surefire_.run(_Surefire_.java:177)
>
>       at sun.reflect.NativeMethodAccessorImpl.invoke0(Native Method)
>
>       at 
> sun.reflect.NativeMethodAccessorImpl.invoke(NativeMethodAccessorImpl.java:39)
>
>       at 
> sun.reflect.DelegatingMethodAccessorImpl.invoke(DelegatingMethodAccessorImpl.java:25)
>
>       at java._lang_.reflect.Method.invoke(Method.java:597)
>
>       at 
> _org_._apache_._maven_._surefire_._booter_.SurefireBooter.runSuitesInProcess(SurefireBooter.java:334)
>
>       at 
> _org_._apache_._maven_._surefire_._booter_.SurefireBooter.main(SurefireBooter.java:980)
>
>  
>
> marshallUTF8(_org_._uddi_.api_v3.AuthInfoTest)  Time elapsed: 0.25 
> _sec_  <<< FAILURE!
>
> _junit_.framework.ComparisonFailure: null expected:<<fragment 
> xmlns:ns[3="urn:uddi-org:api_v3" 
> xmlns:ns2="http://www.w3.org/2000/09/xmldsig#]">
>
>     <ns3:authInfo...> but was:<<fragment 
> xmlns:ns[2="http://www.w3.org/2000/09/xmldsig#" 
> xmlns:ns3="urn:uddi-org:api_v3]">
>
>     <ns3:authInfo...>
>
>       at _junit_.framework.Assert.assertEquals(Assert.java:81)
>
>       at _junit_.framework.Assert.assertEquals(Assert.java:87)
>
>       at 
> _org_._uddi_.api_v3.AuthInfoTest.marshallUTF8(AuthInfoTest.java:91)
>
>       at sun.reflect.NativeMethodAccessorImpl.invoke0(Native Method)
>
>       at 
> sun.reflect.NativeMethodAccessorImpl.invoke(NativeMethodAccessorImpl.java:39)
>
>       at 
> sun.reflect.DelegatingMethodAccessorImpl.invoke(DelegatingMethodAccessorImpl.java:25)
>
>       at java._lang_.reflect.Method.invoke(Method.java:597)
>
>       at 
> _org_._junit_.runners.model.FrameworkMethod$1.runReflectiveCall(FrameworkMethod.java:44)
>
>       at 
> _org_._junit_.internal.runners.model.ReflectiveCallable.run(ReflectiveCallable.java:15)
>
>       at 
> _org_._junit_.runners.model.FrameworkMethod.invokeExplosively(FrameworkMethod.java:41)
>
>       at 
> _org_._junit_.internal.runners.statements.InvokeMethod.evaluate(InvokeMethod.java:20)
>
>       at 
> _org_._junit_.internal.runners.statements.RunBefores.evaluate(RunBefores.java:28)
>
>       at 
> _org_._junit_.internal.runners.statements.RunAfters.evaluate(RunAfters.java:31)
>
>       at 
> _org_._junit_.runners.BlockJUnit4ClassRunner.runChild(BlockJUnit4ClassRunner.java:73)
>
>       at 
> _org_._junit_.runners.BlockJUnit4ClassRunner.runChild(BlockJUnit4ClassRunner.java:46)
>
>       at 
> _org_._junit_.runners.ParentRunner.runChildren(ParentRunner.java:180)
>
>       at 
> _org_._junit_.runners.ParentRunner.access$000(ParentRunner.java:41)
>
>       at org.junit.runners.ParentRunner$1.evaluate(ParentRunner.java:173)
>
>       at 
> org.junit.internal.runners.statements.RunBefores.evaluate(RunBefores.java:28)
>
>       at 
> org.junit.internal.runners.statements.RunAfters.evaluate(RunAfters.java:31)
>
>       at org.junit.runners.ParentRunner.run(ParentRunner.java:220)
>
>       at 
> org.apache.maven.surefire.junit4.JUnit4TestSet.execute(JUnit4TestSet.java:62)
>
>       at 
> org.apache.maven.surefire.suite.AbstractDirectoryTestSuite.executeTestSet(AbstractDirectoryTestSuite.java:140)
>
>       at 
> org.apache.maven.surefire.suite.AbstractDirectoryTestSuite.execute(AbstractDirectoryTestSuite.java:127)
>
>       at org.apache.maven.surefire.Surefire.run(Surefire.java:177)
>
>       at sun.reflect.NativeMethodAccessorImpl.invoke0(Native Method)
>
>       at 
> sun.reflect.NativeMethodAccessorImpl.invoke(NativeMethodAccessorImpl.java:39)
>
>       at 
> sun.reflect.DelegatingMethodAccessorImpl.invoke(DelegatingMethodAccessorImpl.java:25)
>
>       at java.lang.reflect.Method.invoke(Method.java:597)
>
>       at 
> org.apache.maven.surefire.booter.SurefireBooter.runSuitesInProcess(SurefireBooter.java:334)
>
>       at 
> org.apache.maven.surefire.booter.SurefireBooter.main(SurefireBooter.java:980)
>
>  
>
>  
>


Mime
View raw message