jspwiki-commits mailing list archives

Site index · List index
Message view « Date » · « Thread »
Top « Date » · « Thread »
From Apache Jenkins Server <jenk...@builds.apache.org>
Subject Build failed in Jenkins: JSPWiki #491
Date Thu, 19 Apr 2018 18:22:01 GMT
See <https://builds.apache.org/job/JSPWiki/491/display/redirect?page=changes>

Changes:

[brushed] Adding FAVICON to the haddock template

------------------------------------------
[...truncated 369.82 KB...]
[INFO] Running org.apache.wiki.plugin.DefaultPluginManagerTest
[INFO] Tests run: 15, Failures: 0, Errors: 0, Skipped: 0, Time elapsed: 0.418 s - in org.apache.wiki.plugin.DefaultPluginManagerTest
[INFO] Running org.apache.wiki.plugin.CounterPluginTest
[INFO] Tests run: 6, Failures: 0, Errors: 0, Skipped: 0, Time elapsed: 0.159 s - in org.apache.wiki.plugin.CounterPluginTest
[INFO] Running org.apache.wiki.plugin.TableOfContentsTest
[INFO] Tests run: 8, Failures: 0, Errors: 0, Skipped: 0, Time elapsed: 0.337 s - in org.apache.wiki.plugin.TableOfContentsTest
[INFO] Running org.apache.wiki.plugin.RecentChangesPluginTest
[INFO] Tests run: 4, Failures: 0, Errors: 0, Skipped: 0, Time elapsed: 0.557 s - in org.apache.wiki.plugin.RecentChangesPluginTest
[INFO] Running org.apache.wiki.plugin.ReferringPagesPluginTest
[INFO] Tests run: 8, Failures: 0, Errors: 0, Skipped: 0, Time elapsed: 0.524 s - in org.apache.wiki.plugin.ReferringPagesPluginTest
[INFO] Running org.apache.wiki.plugin.UndefinedPagesPluginTest
[INFO] Tests run: 2, Failures: 0, Errors: 0, Skipped: 0, Time elapsed: 0.163 s - in org.apache.wiki.plugin.UndefinedPagesPluginTest
[INFO] Running org.apache.wiki.plugin.ReferringUndefinedPagesPluginTest
[INFO] Tests run: 4, Failures: 0, Errors: 0, Skipped: 0, Time elapsed: 0.335 s - in org.apache.wiki.plugin.ReferringUndefinedPagesPluginTest
[INFO] Running org.apache.wiki.plugin.GroupsTest
[INFO] Tests run: 1, Failures: 0, Errors: 0, Skipped: 0, Time elapsed: 0.02 s - in org.apache.wiki.plugin.GroupsTest
[INFO] Running org.apache.wiki.plugin.PageViewPluginTest
[INFO] Tests run: 4, Failures: 0, Errors: 0, Skipped: 0, Time elapsed: 0.332 s - in org.apache.wiki.plugin.PageViewPluginTest
[INFO] Running org.apache.wiki.ReferenceManagerTest
[INFO] Tests run: 18, Failures: 0, Errors: 0, Skipped: 0, Time elapsed: 1.035 s - in org.apache.wiki.ReferenceManagerTest
[INFO] Running org.apache.wiki.render.RenderingManagerTest
[INFO] Tests run: 1, Failures: 0, Errors: 0, Skipped: 0, Time elapsed: 0.702 s - in org.apache.wiki.render.RenderingManagerTest
[INFO] Running org.apache.wiki.render.CreoleRendererTest
[INFO] Tests run: 14, Failures: 0, Errors: 0, Skipped: 0, Time elapsed: 0.196 s - in org.apache.wiki.render.CreoleRendererTest
[INFO] Running org.apache.wiki.render.WysiwygEditingRendererTest
[INFO] Tests run: 2, Failures: 0, Errors: 0, Skipped: 0, Time elapsed: 0.045 s - in org.apache.wiki.render.WysiwygEditingRendererTest
[INFO] Running org.apache.wiki.attachment.AttachmentManagerTest
[INFO] Tests run: 14, Failures: 0, Errors: 0, Skipped: 0, Time elapsed: 0.688 s - in org.apache.wiki.attachment.AttachmentManagerTest
[INFO] Running org.apache.wiki.filters.DefaultFilterManagerTest
[INFO] Tests run: 2, Failures: 0, Errors: 0, Skipped: 0, Time elapsed: 0.02 s - in org.apache.wiki.filters.DefaultFilterManagerTest
[INFO] Running org.apache.wiki.htmltowiki.HtmlStringToWikiTranslatorTest
[INFO] Tests run: 17, Failures: 0, Errors: 0, Skipped: 0, Time elapsed: 0.164 s - in org.apache.wiki.htmltowiki.HtmlStringToWikiTranslatorTest
[INFO] Running org.apache.wiki.url.ShortURLConstructorTest
[INFO] Tests run: 13, Failures: 0, Errors: 0, Skipped: 0, Time elapsed: 0.127 s - in org.apache.wiki.url.ShortURLConstructorTest
[INFO] Running org.apache.wiki.url.ShortViewURLConstructorTest
[INFO] Tests run: 13, Failures: 0, Errors: 0, Skipped: 0, Time elapsed: 0.116 s - in org.apache.wiki.url.ShortViewURLConstructorTest
[INFO] Running org.apache.wiki.url.DefaultURLConstructorTest
[INFO] Tests run: 13, Failures: 0, Errors: 0, Skipped: 0, Time elapsed: 0.109 s - in org.apache.wiki.url.DefaultURLConstructorTest
[INFO] Running org.apache.wiki.ui.PageCommandTest
[ERROR] Tests run: 2, Failures: 0, Errors: 1, Skipped: 0, Time elapsed: 0.028 s <<<
FAILURE! - in org.apache.wiki.ui.PageCommandTest
[ERROR] testTargetedCommand(org.apache.wiki.ui.PageCommandTest)  Time elapsed: 0.016 s  <<<
ERROR!
java.lang.NullPointerException
	at org.apache.wiki.ui.PageCommandTest.tearDown(PageCommandTest.java:53)

[INFO] Running org.apache.wiki.ui.InputValidatorTest
[INFO] Tests run: 4, Failures: 0, Errors: 0, Skipped: 0, Time elapsed: 0.033 s - in org.apache.wiki.ui.InputValidatorTest
[INFO] Running org.apache.wiki.ui.RedirectCommandTest
[INFO] Tests run: 2, Failures: 0, Errors: 0, Skipped: 0, Time elapsed: 0.001 s - in org.apache.wiki.ui.RedirectCommandTest
[INFO] Running org.apache.wiki.ui.CommandResolverTest
[INFO] Tests run: 6, Failures: 0, Errors: 0, Skipped: 0, Time elapsed: 0.087 s - in org.apache.wiki.ui.CommandResolverTest
[INFO] Running org.apache.wiki.ui.GroupCommandTest
[INFO] Tests run: 2, Failures: 0, Errors: 0, Skipped: 0, Time elapsed: 0.016 s - in org.apache.wiki.ui.GroupCommandTest
[INFO] Running org.apache.wiki.ui.WikiCommandTest
[INFO] Tests run: 2, Failures: 0, Errors: 0, Skipped: 0, Time elapsed: 0.016 s - in org.apache.wiki.ui.WikiCommandTest
[INFO] Running org.apache.wiki.ui.admin.beans.PluginBeanTest
[INFO] Tests run: 1, Failures: 0, Errors: 0, Skipped: 0, Time elapsed: 0.007 s - in org.apache.wiki.ui.admin.beans.PluginBeanTest
[INFO] Running org.apache.wiki.ui.admin.beans.FilterBeanTest
[INFO] Tests run: 1, Failures: 0, Errors: 0, Skipped: 0, Time elapsed: 0.007 s - in org.apache.wiki.ui.admin.beans.FilterBeanTest
[INFO] Running org.apache.wiki.WikiAjaxServletTest
[INFO] Tests run: 1, Failures: 0, Errors: 0, Skipped: 0, Time elapsed: 0.048 s - in org.apache.wiki.WikiAjaxServletTest
[INFO] Running org.apache.wiki.PageSorterTest
[INFO] Tests run: 5, Failures: 0, Errors: 0, Skipped: 0, Time elapsed: 0.003 s - in org.apache.wiki.PageSorterTest
[INFO] Running org.apache.wiki.util.CommentedPropertiesTest
[INFO] Tests run: 4, Failures: 0, Errors: 0, Skipped: 0, Time elapsed: 0.002 s - in org.apache.wiki.util.CommentedPropertiesTest
[INFO] Running org.apache.wiki.util.MailUtilTest
Reason: 454 4.7.0 TLS not available due to local problem

I could not test whether mail sending works, we let the test pass anyway.
[INFO] Tests run: 2, Failures: 0, Errors: 0, Skipped: 0, Time elapsed: 1.129 s - in org.apache.wiki.util.MailUtilTest
[INFO] Running org.apache.wiki.util.comparators.HumanComparatorTest
[INFO] Tests run: 2, Failures: 0, Errors: 0, Skipped: 0, Time elapsed: 0 s - in org.apache.wiki.util.comparators.HumanComparatorTest
[INFO] Running org.apache.wiki.util.CryptoUtilTest
[INFO] Tests run: 8, Failures: 0, Errors: 0, Skipped: 0, Time elapsed: 0.001 s - in org.apache.wiki.util.CryptoUtilTest
[INFO] Running org.apache.wiki.util.FileUtilTest
[INFO] Tests run: 5, Failures: 0, Errors: 0, Skipped: 0, Time elapsed: 0.007 s - in org.apache.wiki.util.FileUtilTest
[INFO] Running org.apache.wiki.util.TextUtilTest
[INFO] Tests run: 42, Failures: 0, Errors: 0, Skipped: 0, Time elapsed: 0.066 s - in org.apache.wiki.util.TextUtilTest
[INFO] Running org.apache.wiki.util.PriorityListTest
[INFO] Tests run: 4, Failures: 0, Errors: 0, Skipped: 0, Time elapsed: 0.001 s - in org.apache.wiki.util.PriorityListTest
[INFO] Running org.apache.wiki.util.PropertyReaderTest
[INFO] Tests run: 1, Failures: 0, Errors: 0, Skipped: 0, Time elapsed: 0 s - in org.apache.wiki.util.PropertyReaderTest
[INFO] Running org.apache.wiki.util.ByteUtilsTest
[INFO] Tests run: 3, Failures: 0, Errors: 0, Skipped: 0, Time elapsed: 0 s - in org.apache.wiki.util.ByteUtilsTest
[INFO] Running org.apache.wiki.util.XmlUtilTest
[INFO] Tests run: 2, Failures: 0, Errors: 0, Skipped: 0, Time elapsed: 0.002 s - in org.apache.wiki.util.XmlUtilTest
[INFO] Running org.apache.wiki.util.SerializerTest
[INFO] Tests run: 1, Failures: 0, Errors: 0, Skipped: 0, Time elapsed: 0 s - in org.apache.wiki.util.SerializerTest
[INFO] Running org.apache.wiki.util.ClassUtilTest
[INFO] Tests run: 4, Failures: 0, Errors: 0, Skipped: 0, Time elapsed: 0.134 s - in org.apache.wiki.util.ClassUtilTest
[INFO] Running org.apache.wiki.util.TimedCounterListTest
[INFO] Tests run: 2, Failures: 0, Errors: 0, Skipped: 0, Time elapsed: 0.104 s - in org.apache.wiki.util.TimedCounterListTest
[INFO] Running org.apache.wiki.providers.BasicAttachmentProviderTest
[INFO] Tests run: 12, Failures: 0, Errors: 0, Skipped: 0, Time elapsed: 10.364 s - in org.apache.wiki.providers.BasicAttachmentProviderTest
[INFO] Running org.apache.wiki.providers.VersioningFileProviderTest
[INFO] Tests run: 20, Failures: 0, Errors: 0, Skipped: 0, Time elapsed: 1.423 s - in org.apache.wiki.providers.VersioningFileProviderTest
[INFO] Running org.apache.wiki.providers.CachingProviderTest
[INFO] Tests run: 2, Failures: 0, Errors: 0, Skipped: 0, Time elapsed: 4.12 s - in org.apache.wiki.providers.CachingProviderTest
[INFO] Running org.apache.wiki.providers.FileSystemProviderTest
[INFO] Tests run: 10, Failures: 0, Errors: 0, Skipped: 0, Time elapsed: 0.11 s - in org.apache.wiki.providers.FileSystemProviderTest
[INFO] Running org.apache.wiki.WikiSessionTest
[INFO] Tests run: 7, Failures: 0, Errors: 0, Skipped: 0, Time elapsed: 0.099 s - in org.apache.wiki.WikiSessionTest
[INFO] Running org.apache.wiki.parser.JSPWikiMarkupParserTest
Trying to crash parser with a line which is 198002 chars in size
100 page renderings: 0:00:00.151 (662.2516556291391 renderings/second)
[INFO] Tests run: 207, Failures: 0, Errors: 0, Skipped: 0, Time elapsed: 7.359 s - in org.apache.wiki.parser.JSPWikiMarkupParserTest
[INFO] Running org.apache.wiki.parser.CreoleToJSPWikiTranslatorTest
[INFO] Tests run: 84, Failures: 0, Errors: 0, Skipped: 0, Time elapsed: 0.147 s - in org.apache.wiki.parser.CreoleToJSPWikiTranslatorTest
[INFO] Running org.apache.wiki.parser.MarkupParserTest
[INFO] Tests run: 3, Failures: 0, Errors: 0, Skipped: 0, Time elapsed: 0 s - in org.apache.wiki.parser.MarkupParserTest
[INFO] Running org.apache.wiki.PropertyReaderTest
[INFO] Tests run: 3, Failures: 0, Errors: 0, Skipped: 0, Time elapsed: 0.001 s - in org.apache.wiki.PropertyReaderTest
[INFO] Running org.apache.wiki.xmlrpc.RPCHandlerTest
[INFO] Tests run: 6, Failures: 0, Errors: 0, Skipped: 0, Time elapsed: 0.178 s - in org.apache.wiki.xmlrpc.RPCHandlerTest
[INFO] Running org.apache.wiki.rss.RSSGeneratorTest
[INFO] Tests run: 2, Failures: 0, Errors: 0, Skipped: 0, Time elapsed: 0.105 s - in org.apache.wiki.rss.RSSGeneratorTest
[INFO] Running org.apache.wiki.i18n.InternationalizationManagerTest
[INFO] Tests run: 2, Failures: 0, Errors: 0, Skipped: 0, Time elapsed: 0.002 s - in org.apache.wiki.i18n.InternationalizationManagerTest
[INFO] Running org.apache.wiki.ReleaseTest
[INFO] Tests run: 17, Failures: 0, Errors: 0, Skipped: 0, Time elapsed: 0.002 s - in org.apache.wiki.ReleaseTest
[INFO] Running org.apache.wiki.workflow.ApprovalWorkflowTest
[INFO] Tests run: 5, Failures: 0, Errors: 0, Skipped: 0, Time elapsed: 0.063 s - in org.apache.wiki.workflow.ApprovalWorkflowTest
[INFO] Running org.apache.wiki.workflow.OutcomeTest
[INFO] Tests run: 6, Failures: 0, Errors: 0, Skipped: 0, Time elapsed: 0.007 s - in org.apache.wiki.workflow.OutcomeTest
[INFO] Running org.apache.wiki.workflow.DecisionQueueTest
[INFO] Tests run: 7, Failures: 0, Errors: 0, Skipped: 0, Time elapsed: 0.067 s - in org.apache.wiki.workflow.DecisionQueueTest
[INFO] Running org.apache.wiki.workflow.TaskTest
[INFO] Tests run: 12, Failures: 0, Errors: 0, Skipped: 0, Time elapsed: 0.001 s - in org.apache.wiki.workflow.TaskTest
[INFO] Running org.apache.wiki.workflow.FactTest
[INFO] Tests run: 1, Failures: 0, Errors: 0, Skipped: 0, Time elapsed: 0 s - in org.apache.wiki.workflow.FactTest
[INFO] Running org.apache.wiki.workflow.SimpleDecisionTest
[INFO] Tests run: 16, Failures: 0, Errors: 0, Skipped: 0, Time elapsed: 0.001 s - in org.apache.wiki.workflow.SimpleDecisionTest
[INFO] Running org.apache.wiki.workflow.WorkflowManagerTest
[INFO] Tests run: 4, Failures: 0, Errors: 0, Skipped: 0, Time elapsed: 0.028 s - in org.apache.wiki.workflow.WorkflowManagerTest
[INFO] Running org.apache.wiki.workflow.WorkflowTest
[INFO] Tests run: 24, Failures: 0, Errors: 0, Skipped: 0, Time elapsed: 0.005 s - in org.apache.wiki.workflow.WorkflowTest
[INFO] Running org.apache.wiki.diff.ContextualDiffProviderTest
[INFO] Tests run: 6, Failures: 0, Errors: 0, Skipped: 0, Time elapsed: 0.232 s - in org.apache.wiki.diff.ContextualDiffProviderTest
[INFO] Running org.apache.wiki.auth.user.XMLUserDatabaseTest
[INFO] Tests run: 11, Failures: 0, Errors: 0, Skipped: 0, Time elapsed: 0.092 s - in org.apache.wiki.auth.user.XMLUserDatabaseTest
[INFO] Running org.apache.wiki.auth.user.UserProfileTest
[INFO] Tests run: 5, Failures: 0, Errors: 0, Skipped: 0, Time elapsed: 0.041 s - in org.apache.wiki.auth.user.UserProfileTest
[INFO] Running org.apache.wiki.auth.user.JDBCUserDatabaseTest
[Server@16ac5012]: [Thread[main,5,main]]: setSilent(true)
[Server@19b2386a]: [Thread[main,5,main]]: setSilent(true)
[Server@a873af3]: [Thread[main,5,main]]: setSilent(true)
[Server@2391d182]: [Thread[main,5,main]]: setSilent(true)
[Server@21f8dc99]: [Thread[main,5,main]]: setSilent(true)
[Server@163dbab7]: [Thread[main,5,main]]: setSilent(true)
[Server@650b44bb]: [Thread[main,5,main]]: setSilent(true)
[Server@e17509f]: [Thread[main,5,main]]: setSilent(true)
[Server@3cff7d09]: [Thread[main,5,main]]: setSilent(true)
[Server@4179c68b]: [Thread[main,5,main]]: setSilent(true)
[Server@54a4f77a]: [Thread[main,5,main]]: setSilent(true)
[INFO] Tests run: 11, Failures: 0, Errors: 0, Skipped: 0, Time elapsed: 22.237 s - in org.apache.wiki.auth.user.JDBCUserDatabaseTest
[INFO] Running org.apache.wiki.auth.authorize.WebContainerAuthorizerTest
[INFO] Tests run: 4, Failures: 0, Errors: 0, Skipped: 0, Time elapsed: 0.084 s - in org.apache.wiki.auth.authorize.WebContainerAuthorizerTest
[INFO] Running org.apache.wiki.auth.authorize.JDBCGroupDatabaseTest
[Server@299de41d]: [Thread[main,5,main]]: setSilent(true)
[Server@3aee5162]: [Thread[main,5,main]]: setSilent(true)
[Server@65f53f4b]: [Thread[main,5,main]]: setSilent(true)
[Server@680af532]: [Thread[main,5,main]]: setSilent(true)
[INFO] Tests run: 4, Failures: 0, Errors: 0, Skipped: 0, Time elapsed: 13.754 s - in org.apache.wiki.auth.authorize.JDBCGroupDatabaseTest
[INFO] Running org.apache.wiki.auth.authorize.XMLGroupDatabaseTest
[INFO] Tests run: 4, Failures: 0, Errors: 0, Skipped: 0, Time elapsed: 0.098 s - in org.apache.wiki.auth.authorize.XMLGroupDatabaseTest
[INFO] Running org.apache.wiki.auth.authorize.GroupTest
[INFO] Tests run: 8, Failures: 0, Errors: 0, Skipped: 0, Time elapsed: 0.078 s - in org.apache.wiki.auth.authorize.GroupTest
[INFO] Running org.apache.wiki.auth.permissions.AllPermissionTest
[INFO] Tests run: 5, Failures: 0, Errors: 0, Skipped: 0, Time elapsed: 0 s - in org.apache.wiki.auth.permissions.AllPermissionTest
[INFO] Running org.apache.wiki.auth.permissions.WikiPermissionTest
[INFO] Tests run: 9, Failures: 0, Errors: 0, Skipped: 0, Time elapsed: 0.001 s - in org.apache.wiki.auth.permissions.WikiPermissionTest
[INFO] Running org.apache.wiki.auth.permissions.AllPermissionCollectionTest
[INFO] Tests run: 8, Failures: 0, Errors: 0, Skipped: 0, Time elapsed: 0 s - in org.apache.wiki.auth.permissions.AllPermissionCollectionTest
[INFO] Running org.apache.wiki.auth.GroupManagerTest
[INFO] Tests run: 4, Failures: 0, Errors: 0, Skipped: 0, Time elapsed: 0.081 s - in org.apache.wiki.auth.GroupManagerTest
[INFO] Running org.apache.wiki.auth.UserManagerTest
[INFO] Tests run: 5, Failures: 0, Errors: 0, Skipped: 0, Time elapsed: 0.249 s - in org.apache.wiki.auth.UserManagerTest
[INFO] Running org.apache.wiki.auth.AuthorizationManagerTest
[INFO] Tests run: 17, Failures: 0, Errors: 0, Skipped: 0, Time elapsed: 0.401 s - in org.apache.wiki.auth.AuthorizationManagerTest
[INFO] Running org.apache.wiki.auth.acl.DefaultAclManagerTest
[INFO] Tests run: 3, Failures: 0, Errors: 0, Skipped: 0, Time elapsed: 0.064 s - in org.apache.wiki.auth.acl.DefaultAclManagerTest
[INFO] Running org.apache.wiki.auth.acl.AclImplTest
[INFO] Tests run: 6, Failures: 0, Errors: 0, Skipped: 0, Time elapsed: 0.071 s - in org.apache.wiki.auth.acl.AclImplTest
[INFO] Running org.apache.wiki.auth.acl.AclEntryImplTest
[INFO] Tests run: 7, Failures: 0, Errors: 0, Skipped: 0, Time elapsed: 0.001 s - in org.apache.wiki.auth.acl.AclEntryImplTest
[INFO] Running org.apache.wiki.auth.AuthenticationManagerTest
[INFO] Tests run: 6, Failures: 0, Errors: 0, Skipped: 0, Time elapsed: 0.088 s - in org.apache.wiki.auth.AuthenticationManagerTest
[INFO] Running org.apache.wiki.PageManagerTest
[INFO] Tests run: 2, Failures: 0, Errors: 0, Skipped: 0, Time elapsed: 0.015 s - in org.apache.wiki.PageManagerTest
[INFO] Running org.apache.wiki.WikiEngineTest
[INFO] Tests run: 40, Failures: 0, Errors: 0, Skipped: 0, Time elapsed: 1.412 s - in org.apache.wiki.WikiEngineTest
[INFO] Running org.apache.wiki.content.PageRenamerTest
[INFO] Tests run: 21, Failures: 0, Errors: 0, Skipped: 0, Time elapsed: 0.939 s - in org.apache.wiki.content.PageRenamerTest
[INFO] Running org.apache.wiki.VariableManagerTest
[INFO] Tests run: 12, Failures: 0, Errors: 0, Skipped: 0, Time elapsed: 0.105 s - in org.apache.wiki.VariableManagerTest
[INFO] 
[INFO] Results:
[INFO] 
[ERROR] Errors: 
[ERROR]   PageCommandTest.tearDown:53 ยป NullPointer
[INFO] 
[ERROR] Tests run: 930, Failures: 0, Errors: 1, Skipped: 0
[INFO] 
[INFO] ------------------------------------------------------------------------
[INFO] Reactor Summary:
[INFO] 
[INFO] Apache JSPWiki .................................... SUCCESS [3.537s]
[INFO] Apache JSPWiki initial wiki pages builder ......... SUCCESS [0.042s]
[INFO] Apache JSPWiki initial wiki pages (de) ............ SUCCESS [1.424s]
[INFO] Apache JSPWiki initial wiki pages (en) ............ SUCCESS [0.182s]
[INFO] Apache JSPWiki initial wiki pages (es) ............ SUCCESS [0.196s]
[INFO] Apache JSPWiki initial wiki pages (fi) ............ SUCCESS [0.095s]
[INFO] Apache JSPWiki initial wiki pages (fr) ............ SUCCESS [0.149s]
[INFO] Apache JSPWiki initial wiki pages (it) ............ SUCCESS [0.153s]
[INFO] Apache JSPWiki initial wiki pages (nl) ............ SUCCESS [0.156s]
[INFO] Apache JSPWiki initial wiki pages (pt_BR) ......... SUCCESS [0.182s]
[INFO] Apache JSPWiki initial wiki pages (ru) ............ SUCCESS [0.124s]
[INFO] Apache JSPWiki initial wiki pages (zh_CN) ......... SUCCESS [0.130s]
[INFO] Apache JSPWiki Main War ........................... FAILURE [1:57.332s]
[INFO] Apache JSPWiki portable ........................... SKIPPED
[INFO] jspwiki-it-builder ................................ SKIPPED
[INFO] jspwiki-selenium-tests ............................ SKIPPED
[INFO] jspwiki-it-test-custom ............................ SKIPPED
[INFO] jspwiki-it-test-custom-absolute-urls .............. SKIPPED
[INFO] jspwiki-it-test-custom-jdbc ....................... SKIPPED
[INFO] jspwiki-it-test-cma ............................... SKIPPED
[INFO] jspwiki-it-test-cma-jdbc .......................... SKIPPED
[INFO] Apache JSPWiki markdown support ................... SKIPPED
[INFO] ------------------------------------------------------------------------
[INFO] BUILD FAILURE
[INFO] ------------------------------------------------------------------------
[INFO] Total time: 2:04.563s
[INFO] Finished at: Thu Apr 19 18:22:00 UTC 2018
[INFO] Final Memory: 62M/2547M
[INFO] ------------------------------------------------------------------------
[ERROR] Failed to execute goal org.apache.maven.plugins:maven-surefire-plugin:2.20.1:test
(default-test) on project jspwiki-war: There are test failures.
[ERROR] 
[ERROR] Please refer to <https://builds.apache.org/job/JSPWiki/ws/jspwiki-war/target/surefire-reports>
for the individual test results.
[ERROR] Please refer to dump files (if any exist) [date]-jvmRun[N].dump, [date].dumpstream
and [date]-jvmRun[N].dumpstream.
[ERROR] -> [Help 1]
[ERROR] 
[ERROR] To see the full stack trace of the errors, re-run Maven with the -e switch.
[ERROR] Re-run Maven using the -X switch to enable full debug logging.
[ERROR] 
[ERROR] For more information about the errors and possible solutions, please read the following
articles:
[ERROR] [Help 1] http://cwiki.apache.org/confluence/display/MAVEN/MojoFailureException
[ERROR] 
[ERROR] After correcting the problems, you can resume the build with the command
[ERROR]   mvn <goals> -rf :jspwiki-war
Build step 'Invoke top-level Maven targets' marked build as failure

Mime
View raw message