jspwiki-commits mailing list archives

Site index · List index
Message view « Date » · « Thread »
Top « Date » · « Thread »
From Apache Jenkins Server <jenk...@builds.apache.org>
Subject Build failed in Jenkins: JSPWiki #478
Date Fri, 09 Feb 2018 22:09:49 GMT
See <https://builds.apache.org/job/JSPWiki/478/display/redirect?page=changes>

Changes:

[juanpablo] [maven-release-plugin] prepare release 2.10.3-RC2

[juanpablo] [maven-release-plugin] prepare for next development iteration

------------------------------------------
[...truncated 416.57 KB...]
[INFO] Running org.apache.wiki.ReleaseTest
[INFO] Tests run: 17, Failures: 0, Errors: 0, Skipped: 0, Time elapsed: 0.002 s - in org.apache.wiki.ReleaseTest
[INFO] Running org.apache.wiki.ui.RedirectCommandTest
[INFO] Tests run: 2, Failures: 0, Errors: 0, Skipped: 0, Time elapsed: 0 s - in org.apache.wiki.ui.RedirectCommandTest
[INFO] Running org.apache.wiki.ui.InputValidatorTest
[INFO] Tests run: 4, Failures: 0, Errors: 0, Skipped: 0, Time elapsed: 0.033 s - in org.apache.wiki.ui.InputValidatorTest
[INFO] Running org.apache.wiki.ui.admin.beans.FilterBeanTest
[INFO] Tests run: 1, Failures: 0, Errors: 0, Skipped: 0, Time elapsed: 0.013 s - in org.apache.wiki.ui.admin.beans.FilterBeanTest
[INFO] Running org.apache.wiki.ui.admin.beans.PluginBeanTest
[INFO] Tests run: 1, Failures: 0, Errors: 0, Skipped: 0, Time elapsed: 0.017 s - in org.apache.wiki.ui.admin.beans.PluginBeanTest
[INFO] Running org.apache.wiki.ui.CommandResolverTest
[INFO] Tests run: 6, Failures: 0, Errors: 0, Skipped: 0, Time elapsed: 0.176 s - in org.apache.wiki.ui.CommandResolverTest
[INFO] Running org.apache.wiki.ui.WikiCommandTest
[INFO] Tests run: 2, Failures: 0, Errors: 0, Skipped: 0, Time elapsed: 0.03 s - in org.apache.wiki.ui.WikiCommandTest
[INFO] Running org.apache.wiki.ui.GroupCommandTest
[INFO] Tests run: 2, Failures: 0, Errors: 0, Skipped: 0, Time elapsed: 0.027 s - in org.apache.wiki.ui.GroupCommandTest
[INFO] Running org.apache.wiki.ui.PageCommandTest
[INFO] Tests run: 2, Failures: 0, Errors: 0, Skipped: 0, Time elapsed: 0.041 s - in org.apache.wiki.ui.PageCommandTest
[INFO] Running org.apache.wiki.providers.BasicAttachmentProviderTest
[INFO] Tests run: 12, Failures: 0, Errors: 0, Skipped: 0, Time elapsed: 10.44 s - in org.apache.wiki.providers.BasicAttachmentProviderTest
[INFO] Running org.apache.wiki.providers.FileSystemProviderTest
[INFO] Tests run: 10, Failures: 0, Errors: 0, Skipped: 0, Time elapsed: 0.15 s - in org.apache.wiki.providers.FileSystemProviderTest
[INFO] Running org.apache.wiki.providers.VersioningFileProviderTest
[INFO] Tests run: 20, Failures: 0, Errors: 0, Skipped: 0, Time elapsed: 2.048 s - in org.apache.wiki.providers.VersioningFileProviderTest
[INFO] Running org.apache.wiki.providers.CachingProviderTest
[INFO] Tests run: 2, Failures: 0, Errors: 0, Skipped: 0, Time elapsed: 4.197 s - in org.apache.wiki.providers.CachingProviderTest
[INFO] Running org.apache.wiki.search.SearchManagerTest
[INFO] Tests run: 7, Failures: 0, Errors: 0, Skipped: 0, Time elapsed: 12.622 s - in org.apache.wiki.search.SearchManagerTest
[INFO] Running org.apache.wiki.WikiSessionTest
[INFO] Tests run: 7, Failures: 0, Errors: 0, Skipped: 0, Time elapsed: 0.101 s - in org.apache.wiki.WikiSessionTest
[INFO] Running org.apache.wiki.plugin.PageViewPluginTest
[INFO] Tests run: 4, Failures: 0, Errors: 0, Skipped: 0, Time elapsed: 0.261 s - in org.apache.wiki.plugin.PageViewPluginTest
[INFO] Running org.apache.wiki.plugin.TableOfContentsTest
[INFO] Tests run: 8, Failures: 0, Errors: 0, Skipped: 0, Time elapsed: 0.213 s - in org.apache.wiki.plugin.TableOfContentsTest
[INFO] Running org.apache.wiki.plugin.ReferringPagesPluginTest
[INFO] Tests run: 8, Failures: 0, Errors: 0, Skipped: 0, Time elapsed: 0.345 s - in org.apache.wiki.plugin.ReferringPagesPluginTest
[INFO] Running org.apache.wiki.plugin.RecentChangesPluginTest
[INFO] Tests run: 4, Failures: 0, Errors: 0, Skipped: 0, Time elapsed: 0.247 s - in org.apache.wiki.plugin.RecentChangesPluginTest
[INFO] Running org.apache.wiki.plugin.UndefinedPagesPluginTest
[INFO] Tests run: 2, Failures: 0, Errors: 0, Skipped: 0, Time elapsed: 0.129 s - in org.apache.wiki.plugin.UndefinedPagesPluginTest
[INFO] Running org.apache.wiki.plugin.GroupsTest
[INFO] Tests run: 1, Failures: 0, Errors: 0, Skipped: 0, Time elapsed: 0.016 s - in org.apache.wiki.plugin.GroupsTest
[INFO] Running org.apache.wiki.plugin.ReferringUndefinedPagesPluginTest
[INFO] Tests run: 4, Failures: 0, Errors: 0, Skipped: 0, Time elapsed: 0.24 s - in org.apache.wiki.plugin.ReferringUndefinedPagesPluginTest
[INFO] Running org.apache.wiki.plugin.IfPluginTest
[INFO] Tests run: 4, Failures: 0, Errors: 0, Skipped: 0, Time elapsed: 0.081 s - in org.apache.wiki.plugin.IfPluginTest
[INFO] Running org.apache.wiki.plugin.InsertPageTest
[INFO] Tests run: 6, Failures: 0, Errors: 0, Skipped: 0, Time elapsed: 0.136 s - in org.apache.wiki.plugin.InsertPageTest
[INFO] Running org.apache.wiki.plugin.DefaultPluginManagerTest
[INFO] Tests run: 15, Failures: 0, Errors: 0, Skipped: 0, Time elapsed: 0.211 s - in org.apache.wiki.plugin.DefaultPluginManagerTest
[INFO] Running org.apache.wiki.plugin.CounterPluginTest
[INFO] Tests run: 6, Failures: 0, Errors: 0, Skipped: 0, Time elapsed: 0.085 s - in org.apache.wiki.plugin.CounterPluginTest
[INFO] Running org.apache.wiki.i18n.InternationalizationManagerTest
[INFO] Tests run: 2, Failures: 0, Errors: 0, Skipped: 0, Time elapsed: 0 s - in org.apache.wiki.i18n.InternationalizationManagerTest
[INFO] Running org.apache.wiki.diff.ContextualDiffProviderTest
[INFO] Tests run: 6, Failures: 0, Errors: 0, Skipped: 0, Time elapsed: 0.349 s - in org.apache.wiki.diff.ContextualDiffProviderTest
[INFO] Running org.apache.wiki.htmltowiki.HtmlStringToWikiTranslatorTest
[INFO] Tests run: 17, Failures: 0, Errors: 0, Skipped: 0, Time elapsed: 0.168 s - in org.apache.wiki.htmltowiki.HtmlStringToWikiTranslatorTest
[INFO] Running org.apache.wiki.WikiAjaxServletTest
[INFO] Tests run: 1, Failures: 0, Errors: 0, Skipped: 0, Time elapsed: 0.063 s - in org.apache.wiki.WikiAjaxServletTest
[INFO] Running org.apache.wiki.PropertyReaderTest
[INFO] Tests run: 3, Failures: 0, Errors: 0, Skipped: 0, Time elapsed: 0 s - in org.apache.wiki.PropertyReaderTest
[INFO] Running org.apache.wiki.content.PageRenamerTest
[INFO] Tests run: 21, Failures: 0, Errors: 0, Skipped: 0, Time elapsed: 1.259 s - in org.apache.wiki.content.PageRenamerTest
[INFO] Running org.apache.wiki.render.CreoleRendererTest
[INFO] Tests run: 14, Failures: 0, Errors: 0, Skipped: 0, Time elapsed: 0.152 s - in org.apache.wiki.render.CreoleRendererTest
[INFO] Running org.apache.wiki.render.RenderingManagerTest
[INFO] Tests run: 1, Failures: 0, Errors: 0, Skipped: 0, Time elapsed: 0.734 s - in org.apache.wiki.render.RenderingManagerTest
[INFO] Running org.apache.wiki.render.WysiwygEditingRendererTest
[INFO] Tests run: 2, Failures: 0, Errors: 0, Skipped: 0, Time elapsed: 0.033 s - in org.apache.wiki.render.WysiwygEditingRendererTest
[INFO] Running org.apache.wiki.PageManagerTest
[INFO] Tests run: 2, Failures: 0, Errors: 0, Skipped: 0, Time elapsed: 0.019 s - in org.apache.wiki.PageManagerTest
[INFO] Running org.apache.wiki.xmlrpc.RPCHandlerTest
[INFO] Tests run: 6, Failures: 0, Errors: 0, Skipped: 0, Time elapsed: 0.293 s - in org.apache.wiki.xmlrpc.RPCHandlerTest
[INFO] Running org.apache.wiki.rss.RSSGeneratorTest
[INFO] Tests run: 2, Failures: 0, Errors: 0, Skipped: 0, Time elapsed: 0.166 s - in org.apache.wiki.rss.RSSGeneratorTest
[INFO] Running org.apache.wiki.filters.DefaultFilterManagerTest
[INFO] Tests run: 2, Failures: 0, Errors: 0, Skipped: 0, Time elapsed: 0.034 s - in org.apache.wiki.filters.DefaultFilterManagerTest
[INFO] 
[INFO] Results:
[INFO] 
[INFO] Tests run: 930, Failures: 0, Errors: 0, Skipped: 0
[INFO] 
[INFO] 
[INFO] --- wro4j-maven-plugin:1.8.0:run (buildDefaultJsAndCss) @ jspwiki-war ---
Downloading: http://repo.maven.apache.org/maven2/ro/isdc/wro4j/wro4j-core/1.8.0/wro4j-core-1.8.0.pom
2/2 KB                         Downloaded: http://repo.maven.apache.org/maven2/ro/isdc/wro4j/wro4j-core/1.8.0/wro4j-core-1.8.0.pom
(2 KB at 62.0 KB/sec)
Downloading: http://repo.maven.apache.org/maven2/org/slf4j/slf4j-api/1.7.16/slf4j-api-1.7.16.pom
3/3 KB            Downloaded: http://repo.maven.apache.org/maven2/org/slf4j/slf4j-api/1.7.16/slf4j-api-1.7.16.pom
(3 KB at 169.4 KB/sec)
Downloading: http://repo.maven.apache.org/maven2/ro/isdc/wro4j/wro4j-extensions/1.8.0/wro4j-extensions-1.8.0.pom
4/8 KB   7/8 KB   8/8 KB            Downloaded: http://repo.maven.apache.org/maven2/ro/isdc/wro4j/wro4j-extensions/1.8.0/wro4j-extensions-1.8.0.pom
(8 KB at 440.2 KB/sec)
Downloading: http://repo.maven.apache.org/maven2/org/mozilla/rhino/1.7.7.1/rhino-1.7.7.1.pom
2/2 KB            Downloaded: http://repo.maven.apache.org/maven2/org/mozilla/rhino/1.7.7.1/rhino-1.7.7.1.pom
(2 KB at 75.9 KB/sec)
Downloading: http://repo.maven.apache.org/maven2/org/springframework/spring-web/3.1.1.RELEASE/spring-web-3.1.1.RELEASE.pom
4/6 KB   6/6 KB   6/6 KB            Downloaded: http://repo.maven.apache.org/maven2/org/springframework/spring-web/3.1.1.RELEASE/spring-web-3.1.1.RELEASE.pom
(6 KB at 313.1 KB/sec)
Downloading: http://repo.maven.apache.org/maven2/org/springframework/spring-parent/3.1.1.RELEASE/spring-parent-3.1.1.RELEASE.pom
4/9 KB   8/9 KB   9/9 KB            Downloaded: http://repo.maven.apache.org/maven2/org/springframework/spring-parent/3.1.1.RELEASE/spring-parent-3.1.1.RELEASE.pom
(9 KB at 473.8 KB/sec)
Downloading: http://repo.maven.apache.org/maven2/org/springframework/spring-beans/3.1.1.RELEASE/spring-beans-3.1.1.RELEASE.pom
3/3 KB            Downloaded: http://repo.maven.apache.org/maven2/org/springframework/spring-beans/3.1.1.RELEASE/spring-beans-3.1.1.RELEASE.pom
(3 KB at 148.8 KB/sec)
Downloading: http://repo.maven.apache.org/maven2/org/springframework/spring-core/3.1.1.RELEASE/spring-core-3.1.1.RELEASE.pom
3/3 KB            Downloaded: http://repo.maven.apache.org/maven2/org/springframework/spring-core/3.1.1.RELEASE/spring-core-3.1.1.RELEASE.pom
(3 KB at 150.3 KB/sec)
Downloading: http://repo.maven.apache.org/maven2/org/springframework/spring-asm/3.1.1.RELEASE/spring-asm-3.1.1.RELEASE.pom
3/3 KB            Downloaded: http://repo.maven.apache.org/maven2/org/springframework/spring-asm/3.1.1.RELEASE/spring-asm-3.1.1.RELEASE.pom
(3 KB at 153.7 KB/sec)
Downloading: http://repo.maven.apache.org/maven2/org/springframework/spring-context/3.1.1.RELEASE/spring-context-3.1.1.RELEASE.pom
4/9 KB   7/9 KB   9/9 KB            Downloaded: http://repo.maven.apache.org/maven2/org/springframework/spring-context/3.1.1.RELEASE/spring-context-3.1.1.RELEASE.pom
(9 KB at 497.1 KB/sec)
Downloading: http://repo.maven.apache.org/maven2/org/springframework/spring-aop/3.1.1.RELEASE/spring-aop-3.1.1.RELEASE.pom
1/3 KB   3/3 KB            Downloaded: http://repo.maven.apache.org/maven2/org/springframework/spring-aop/3.1.1.RELEASE/spring-aop-3.1.1.RELEASE.pom
(3 KB at 160.6 KB/sec)
Downloading: http://repo.maven.apache.org/maven2/org/springframework/spring-expression/3.1.1.RELEASE/spring-expression-3.1.1.RELEASE.pom
2/2 KB            Downloaded: http://repo.maven.apache.org/maven2/org/springframework/spring-expression/3.1.1.RELEASE/spring-expression-3.1.1.RELEASE.pom
(2 KB at 102.9 KB/sec)
Downloading: http://repo.maven.apache.org/maven2/com/google/javascript/closure-compiler/v20160315/closure-compiler-v20160315.pom
         [WARNING] Failed to create parent directories for resolution tracking file /home/jenkins/.m2/repository/com/google/javascript/closure-compiler/v20160315/closure-compiler-v20160315.pom.lastUpdated
Downloading: http://repo.maven.apache.org/maven2/com/github/lltyk/dojo-shrinksafe/1.7.2/dojo-shrinksafe-1.7.2.pom
4/6 KB   6/6 KB            Downloaded: http://repo.maven.apache.org/maven2/com/github/lltyk/dojo-shrinksafe/1.7.2/dojo-shrinksafe-1.7.2.pom
(6 KB at 321.9 KB/sec)
Downloading: http://repo.maven.apache.org/maven2/org/dojotoolkit/dojo-maven/1.7.2/dojo-maven-1.7.2.pom
1/10 KB   5/10 KB   9/10 KB   10/10 KB              Downloaded: http://repo.maven.apache.org/maven2/org/dojotoolkit/dojo-maven/1.7.2/dojo-maven-1.7.2.pom
(10 KB at 553.8 KB/sec)
Downloading: http://repo.maven.apache.org/maven2/org/jruby/jruby-core/9.0.5.0/jruby-core-9.0.5.0.pom
4/35 KB    8/35 KB   12/35 KB   16/35 KB   20/35 KB   24/35 KB   28/35 KB   32/35 KB   35/35
KB              Downloaded: http://repo.maven.apache.org/maven2/org/jruby/jruby-core/9.0.5.0/jruby-core-9.0.5.0.pom
(35 KB at 2052.1 KB/sec)
Downloading: http://repo.maven.apache.org/maven2/org/jruby/jruby-parent/9.0.5.0/jruby-parent-9.0.5.0.pom
4/26 KB    6/26 KB   10/26 KB   14/26 KB   18/26 KB   22/26 KB   26/26 KB   26/26 KB     
        Downloaded: http://repo.maven.apache.org/maven2/org/jruby/jruby-parent/9.0.5.0/jruby-parent-9.0.5.0.pom
(26 KB at 1354.7 KB/sec)
Downloading: http://repo.maven.apache.org/maven2/com/github/jnr/jnr-netdb/1.1.5/jnr-netdb-1.1.5.pom
2/2 KB              Downloaded: http://repo.maven.apache.org/maven2/com/github/jnr/jnr-netdb/1.1.5/jnr-netdb-1.1.5.pom
(2 KB at 106.0 KB/sec)
Downloading: http://repo.maven.apache.org/maven2/com/github/jnr/jnr-enxio/0.10/jnr-enxio-0.10.pom
3/3 KB            Downloaded: http://repo.maven.apache.org/maven2/com/github/jnr/jnr-enxio/0.10/jnr-enxio-0.10.pom
(3 KB at 137.2 KB/sec)
Downloading: http://repo.maven.apache.org/maven2/com/github/jnr/jnr-constants/0.9.0/jnr-constants-0.9.0.pom
3/3 KB            Downloaded: http://repo.maven.apache.org/maven2/com/github/jnr/jnr-constants/0.9.0/jnr-constants-0.9.0.pom
(3 KB at 121.9 KB/sec)
Downloading: http://repo.maven.apache.org/maven2/com/github/jnr/jnr-x86asm/1.0.2/jnr-x86asm-1.0.2.pom
2/2 KB            Downloaded: http://repo.maven.apache.org/maven2/com/github/jnr/jnr-x86asm/1.0.2/jnr-x86asm-1.0.2.pom
(2 KB at 100.5 KB/sec)
Downloading: http://repo.maven.apache.org/maven2/com/github/jnr/jnr-unixsocket/0.10/jnr-unixsocket-0.10.pom
3/3 KB            Downloaded: http://repo.maven.apache.org/maven2/com/github/jnr/jnr-unixsocket/0.10/jnr-unixsocket-0.10.pom
(3 KB at 153.7 KB/sec)
Downloading: http://repo.maven.apache.org/maven2/com/github/jnr/jnr-posix/3.0.23/jnr-posix-3.0.23.pom
1/6 KB   5/6 KB   6/6 KB            Downloaded: http://repo.maven.apache.org/maven2/com/github/jnr/jnr-posix/3.0.23/jnr-posix-3.0.23.pom
(6 KB at 318.5 KB/sec)
Downloading: http://repo.maven.apache.org/maven2/com/github/jnr/jnr-posix/3.0.27/jnr-posix-3.0.27.pom
1/6 KB   5/6 KB   6/6 KB            Downloaded: http://repo.maven.apache.org/maven2/com/github/jnr/jnr-posix/3.0.27/jnr-posix-3.0.27.pom
(6 KB at 358.3 KB/sec)
Downloading: http://repo.maven.apache.org/maven2/com/github/jnr/jffi/1.2.10/jffi-1.2.10.pom
4/8 KB   8/8 KB   8/8 KB            Downloaded: http://repo.maven.apache.org/maven2/com/github/jnr/jffi/1.2.10/jffi-1.2.10.pom
(8 KB at 501.8 KB/sec)
Downloading: http://repo.maven.apache.org/maven2/org/jruby/joni/joni/2.1.9/joni-2.1.9.pom
4/5 KB   5/5 KB            Downloaded: http://repo.maven.apache.org/maven2/org/jruby/joni/joni/2.1.9/joni-2.1.9.pom
(5 KB at 253.6 KB/sec)
Downloading: http://repo.maven.apache.org/maven2/org/jruby/jcodings/jcodings/1.0.13/jcodings-1.0.13.pom
4/4 KB            Downloaded: http://repo.maven.apache.org/maven2/org/jruby/jcodings/jcodings/1.0.13/jcodings-1.0.13.pom
(4 KB at 100.9 KB/sec)
Downloading: http://repo.maven.apache.org/maven2/org/jruby/extras/bytelist/1.0.13/bytelist-1.0.13.pom
3/3 KB            Downloaded: http://repo.maven.apache.org/maven2/org/jruby/extras/bytelist/1.0.13/bytelist-1.0.13.pom
(3 KB at 185.4 KB/sec)
Downloading: http://repo.maven.apache.org/maven2/org/jruby/jcodings/jcodings/1.0.12/jcodings-1.0.12.pom
4/4 KB            Downloaded: http://repo.maven.apache.org/maven2/org/jruby/jcodings/jcodings/1.0.12/jcodings-1.0.12.pom
(4 KB at 208.2 KB/sec)
Downloading: http://repo.maven.apache.org/maven2/org/jruby/jcodings/jcodings/1.0.17/jcodings-1.0.17.pom
4/4 KB            Downloaded: http://repo.maven.apache.org/maven2/org/jruby/jcodings/jcodings/1.0.17/jcodings-1.0.17.pom
(4 KB at 208.2 KB/sec)
Downloading: http://repo.maven.apache.org/maven2/org/jruby/dirgra/0.3/dirgra-0.3.pom
3/3 KB            Downloaded: http://repo.maven.apache.org/maven2/org/jruby/dirgra/0.3/dirgra-0.3.pom
(3 KB at 168.3 KB/sec)
Downloading: http://repo.maven.apache.org/maven2/com/headius/invokebinder/1.7/invokebinder-1.7.pom
3/3 KB            Downloaded: http://repo.maven.apache.org/maven2/com/headius/invokebinder/1.7/invokebinder-1.7.pom
(3 KB at 162.9 KB/sec)
Downloading: http://repo.maven.apache.org/maven2/com/headius/options/1.4/options-1.4.pom
2/2 KB            Downloaded: http://repo.maven.apache.org/maven2/com/headius/options/1.4/options-1.4.pom
(2 KB at 85.8 KB/sec)
Downloading: http://repo.maven.apache.org/maven2/com/martiansoftware/nailgun-server/0.9.1/nailgun-server-0.9.1.pom
2/2 KB            Downloaded: http://repo.maven.apache.org/maven2/com/martiansoftware/nailgun-server/0.9.1/nailgun-server-0.9.1.pom
(2 KB at 98.8 KB/sec)
Downloading: http://repo.maven.apache.org/maven2/com/martiansoftware/nailgun-all/0.9.1/nailgun-all-0.9.1.pom
4/5 KB   5/5 KB            Downloaded: http://repo.maven.apache.org/maven2/com/martiansoftware/nailgun-all/0.9.1/nailgun-all-0.9.1.pom
(5 KB at 325.1 KB/sec)
Downloading: http://repo.maven.apache.org/maven2/org/jruby/jruby-stdlib/9.0.5.0/jruby-stdlib-9.0.5.0.pom
4/11 KB   8/11 KB   11/11 KB              Downloaded: http://repo.maven.apache.org/maven2/org/jruby/jruby-stdlib/9.0.5.0/jruby-stdlib-9.0.5.0.pom
(11 KB at 595.6 KB/sec)
Downloading: http://repo.maven.apache.org/maven2/com/darrinholst/sass-java-gems/3.4.20.0/sass-java-gems-3.4.20.0.pom
4/6 KB     6/6 KB            Downloaded: http://repo.maven.apache.org/maven2/com/darrinholst/sass-java-gems/3.4.20.0/sass-java-gems-3.4.20.0.pom
(6 KB at 306.2 KB/sec)
Downloading: http://repo.maven.apache.org/maven2/com/darrinholst/sass-java-parent/3.4.20.0/sass-java-parent-3.4.20.0.pom
2/2 KB            Downloaded: http://repo.maven.apache.org/maven2/com/darrinholst/sass-java-parent/3.4.20.0/sass-java-parent-3.4.20.0.pom
(2 KB at 92.2 KB/sec)
Downloading: http://repo.maven.apache.org/maven2/nz/co/edmi/bourbon-gem-jar/2.1.0/bourbon-gem-jar-2.1.0.pom
4/7 KB   7/7 KB            Downloaded: http://repo.maven.apache.org/maven2/nz/co/edmi/bourbon-gem-jar/2.1.0/bourbon-gem-jar-2.1.0.pom
(7 KB at 402.5 KB/sec)
Downloading: http://repo.maven.apache.org/maven2/me/n4u/sass/sass-gems/maven-metadata.xml
Downloading: https://oss.sonatype.org/content/repositories/snapshots/me/n4u/sass/sass-gems/maven-metadata.xml
518/518 B               Downloaded: http://repo.maven.apache.org/maven2/me/n4u/sass/sass-gems/maven-metadata.xml
(518 B at 29.8 KB/sec)
            Downloading: http://repo.maven.apache.org/maven2/me/n4u/sass/sass-gems/3.1.16/sass-gems-3.1.16.pom
4/7 KB      7/7 KB            Downloaded: http://repo.maven.apache.org/maven2/me/n4u/sass/sass-gems/3.1.16/sass-gems-3.1.16.pom
(7 KB at 348.9 KB/sec)
Downloading: http://repo.maven.apache.org/maven2/me/n4u/sass/sass-gems/3.1.17/sass-gems-3.1.17.pom
4/7 KB   7/7 KB            Downloaded: http://repo.maven.apache.org/maven2/me/n4u/sass/sass-gems/3.1.17/sass-gems-3.1.17.pom
(7 KB at 392.2 KB/sec)
Downloading: http://repo.maven.apache.org/maven2/me/n4u/sass/sass-gems/3.1.18/sass-gems-3.1.18.pom
4/7 KB   6/7 KB   7/7 KB            Downloaded: http://repo.maven.apache.org/maven2/me/n4u/sass/sass-gems/3.1.18/sass-gems-3.1.18.pom
(7 KB at 289.9 KB/sec)
Downloading: http://repo.maven.apache.org/maven2/me/n4u/sass/sass-gems/3.1.19/sass-gems-3.1.19.pom
4/7 KB   7/7 KB            Downloaded: http://repo.maven.apache.org/maven2/me/n4u/sass/sass-gems/3.1.19/sass-gems-3.1.19.pom
(7 KB at 416.7 KB/sec)
Downloading: http://repo.maven.apache.org/maven2/org/webjars/webjars-locator/0.30/webjars-locator-0.30.pom
4/6 KB   6/6 KB            Downloaded: http://repo.maven.apache.org/maven2/org/webjars/webjars-locator/0.30/webjars-locator-0.30.pom
(6 KB at 301.2 KB/sec)
Downloading: http://repo.maven.apache.org/maven2/org/webjars/jshint/2.6.3-2/jshint-2.6.3-2.pom
2/2 KB            Downloaded: http://repo.maven.apache.org/maven2/org/webjars/jshint/2.6.3-2/jshint-2.6.3-2.pom
(2 KB at 65.5 KB/sec)
Downloading: http://repo.maven.apache.org/maven2/org/webjars/jshint-parent/2.6.3-2/jshint-parent-2.6.3-2.pom
4/5 KB   5/5 KB            Downloaded: http://repo.maven.apache.org/maven2/org/webjars/jshint-parent/2.6.3-2/jshint-parent-2.6.3-2.pom
(5 KB at 273.0 KB/sec)
Downloading: http://repo.maven.apache.org/maven2/org/webjars/less/1.3.3/less-1.3.3.pom
4/4 KB            Downloaded: http://repo.maven.apache.org/maven2/org/webjars/less/1.3.3/less-1.3.3.pom
(4 KB at 190.1 KB/sec)
Downloading: http://repo.maven.apache.org/maven2/org/webjars/emberjs/1.9.0-1/emberjs-1.9.0-1.pom
4/6 KB   6/6 KB            Downloaded: http://repo.maven.apache.org/maven2/org/webjars/emberjs/1.9.0-1/emberjs-1.9.0-1.pom
(6 KB at 332.0 KB/sec)
Downloading: http://repo.maven.apache.org/maven2/org/webjars/jquery/1.10.2-1/jquery-1.10.2-1.pom
4/5 KB   5/5 KB            Downloaded: http://repo.maven.apache.org/maven2/org/webjars/jquery/1.10.2-1/jquery-1.10.2-1.pom
(5 KB at 244.8 KB/sec)
Downloading: http://repo.maven.apache.org/maven2/org/webjars/handlebars/1.3.0/handlebars-1.3.0.pom
4/5 KB   5/5 KB            Downloaded: http://repo.maven.apache.org/maven2/org/webjars/handlebars/1.3.0/handlebars-1.3.0.pom
(5 KB at 231.3 KB/sec)
Downloading: http://repo.maven.apache.org/maven2/org/webjars/handlebars/3.0.3/handlebars-3.0.3.pom
4/5 KB   5/5 KB            Downloaded: http://repo.maven.apache.org/maven2/org/webjars/handlebars/3.0.3/handlebars-3.0.3.pom
(5 KB at 255.5 KB/sec)
Downloading: http://repo.maven.apache.org/maven2/org/webjars/coffee-script/1.10.0/coffee-script-1.10.0.pom
2/2 KB            Downloaded: http://repo.maven.apache.org/maven2/org/webjars/coffee-script/1.10.0/coffee-script-1.10.0.pom
(2 KB at 106.0 KB/sec)
Downloading: http://repo.maven.apache.org/maven2/org/webjars/coffee-script-parent/1.10.0/coffee-script-parent-1.10.0.pom
4/5 KB   5/5 KB            Downloaded: http://repo.maven.apache.org/maven2/org/webjars/coffee-script-parent/1.10.0/coffee-script-parent-1.10.0.pom
(5 KB at 280.6 KB/sec)
Downloading: http://repo.maven.apache.org/maven2/org/webjars/envjs/1.2/envjs-1.2.pom
1/3 KB   3/3 KB            Downloaded: http://repo.maven.apache.org/maven2/org/webjars/envjs/1.2/envjs-1.2.pom
(3 KB at 161.8 KB/sec)
Downloading: http://repo.maven.apache.org/maven2/org/webjars/jslint/20140708-394bf29/jslint-20140708-394bf29.pom
4/4 KB            Downloaded: http://repo.maven.apache.org/maven2/org/webjars/jslint/20140708-394bf29/jslint-20140708-394bf29.pom
(4 KB at 215.7 KB/sec)
Downloading: http://repo.maven.apache.org/maven2/org/webjars/json2/20110223/json2-20110223.pom
4/4 KB            Downloaded: http://repo.maven.apache.org/maven2/org/webjars/json2/20110223/json2-20110223.pom
(4 KB at 190.6 KB/sec)
Downloading: http://repo.maven.apache.org/maven2/org/mockito/mockito-core/2.0.42-beta/mockito-core-2.0.42-beta.pom
2/2 KB            Downloaded: http://repo.maven.apache.org/maven2/org/mockito/mockito-core/2.0.42-beta/mockito-core-2.0.42-beta.pom
(2 KB at 85.6 KB/sec)
Downloading: http://repo.maven.apache.org/maven2/net/bytebuddy/byte-buddy/1.2.1/byte-buddy-1.2.1.pom
4/11 KB   8/11 KB   11/11 KB              Downloaded: http://repo.maven.apache.org/maven2/net/bytebuddy/byte-buddy/1.2.1/byte-buddy-1.2.1.pom
(11 KB at 641.1 KB/sec)
Downloading: http://repo.maven.apache.org/maven2/net/bytebuddy/byte-buddy-parent/1.2.1/byte-buddy-parent-1.2.1.pom
4/24 KB    7/24 KB   11/24 KB   15/24 KB   19/24 KB   23/24 KB   24/24 KB              Downloaded:
http://repo.maven.apache.org/maven2/net/bytebuddy/byte-buddy-parent/1.2.1/byte-buddy-parent-1.2.1.pom
(24 KB at 1402.1 KB/sec)
[INFO] ------------------------------------------------------------------------
[INFO] Reactor Summary:
[INFO] 
[INFO] Apache JSPWiki .................................... SUCCESS [3.780s]
[INFO] Apache JSPWiki initial wiki pages builder ......... SUCCESS [0.058s]
[INFO] Apache JSPWiki initial wiki pages (de) ............ SUCCESS [1.793s]
[INFO] Apache JSPWiki initial wiki pages (en) ............ SUCCESS [0.236s]
[INFO] Apache JSPWiki initial wiki pages (es) ............ SUCCESS [0.152s]
[INFO] Apache JSPWiki initial wiki pages (fi) ............ SUCCESS [0.103s]
[INFO] Apache JSPWiki initial wiki pages (fr) ............ SUCCESS [0.161s]
[INFO] Apache JSPWiki initial wiki pages (it) ............ SUCCESS [0.133s]
[INFO] Apache JSPWiki initial wiki pages (nl) ............ SUCCESS [0.155s]
[INFO] Apache JSPWiki initial wiki pages (pt_BR) ......... SUCCESS [0.228s]
[INFO] Apache JSPWiki initial wiki pages (ru) ............ SUCCESS [0.164s]
[INFO] Apache JSPWiki initial wiki pages (zh_CN) ......... SUCCESS [0.174s]
[INFO] Apache JSPWiki Main War ........................... FAILURE [2:00.609s]
[INFO] Apache JSPWiki portable ........................... SKIPPED
[INFO] jspwiki-it-builder ................................ SKIPPED
[INFO] jspwiki-selenium-tests ............................ SKIPPED
[INFO] jspwiki-it-test-custom ............................ SKIPPED
[INFO] jspwiki-it-test-custom-absolute-urls .............. SKIPPED
[INFO] jspwiki-it-test-custom-jdbc ....................... SKIPPED
[INFO] jspwiki-it-test-cma ............................... SKIPPED
[INFO] jspwiki-it-test-cma-jdbc .......................... SKIPPED
[INFO] Apache JSPWiki markdown support ................... SKIPPED
[INFO] ------------------------------------------------------------------------
[INFO] BUILD FAILURE
[INFO] ------------------------------------------------------------------------
[INFO] Total time: 2:09.267s
[INFO] Finished at: Fri Feb 09 22:09:45 UTC 2018
[INFO] Final Memory: 54M/2560M
[INFO] ------------------------------------------------------------------------
[ERROR] Failed to execute goal ro.isdc.wro4j:wro4j-maven-plugin:1.8.0:run (buildDefaultJsAndCss)
on project jspwiki-war: Execution buildDefaultJsAndCss of goal ro.isdc.wro4j:wro4j-maven-plugin:1.8.0:run
failed: Plugin ro.isdc.wro4j:wro4j-maven-plugin:1.8.0 or one of its dependencies could not
be resolved: Failed to collect dependencies for ro.isdc.wro4j:wro4j-maven-plugin:jar:1.8.0
(): Failed to read artifact descriptor for com.google.javascript:closure-compiler:jar:v20160315:
Could not transfer artifact com.google.javascript:closure-compiler:pom:v20160315 from/to central
(http://repo.maven.apache.org/maven2): Specified destination directory cannot be created:
/home/jenkins/.m2/repository/com/google/javascript/closure-compiler/v20160315 -> [Help
1]
[ERROR] 
[ERROR] To see the full stack trace of the errors, re-run Maven with the -e switch.
[ERROR] Re-run Maven using the -X switch to enable full debug logging.
[ERROR] 
[ERROR] For more information about the errors and possible solutions, please read the following
articles:
[ERROR] [Help 1] http://cwiki.apache.org/confluence/display/MAVEN/PluginResolutionException
[ERROR] 
[ERROR] After correcting the problems, you can resume the build with the command
[ERROR]   mvn <goals> -rf :jspwiki-war
Build step 'Invoke top-level Maven targets' marked build as failure

Mime
View raw message