jspwiki-commits mailing list archives

Site index · List index
Message view « Date » · « Thread »
Top « Date » · « Thread »
From Apache Jenkins Server <jenk...@builds.apache.org>
Subject Build failed in Jenkins: JSPWiki-sonarqube #15
Date Tue, 22 Aug 2017 18:14:18 GMT
See <https://builds.apache.org/job/JSPWiki-sonarqube/15/display/redirect?page=changes>

Changes:

[juanpablo] move constants from JSPWikiMarkupParser to MarkupParser

[juanpablo] fix DefaultFilterManager#modules not returning Collection<

[juanpablo] simplify other modules() implementations

[juanpablo] base class for module-based JSPWiki AdminBeans

[juanpablo] new JSPWiki AdminBean exposing existing filters information

[juanpablo] refactor PluginBean by extending ModuleBean instead of SimpleAdminBean

[juanpablo] register FilterBean, method parameter from private void

[juanpablo] RenderingManager is now capable of returning a custom renderer for

[juanpablo] no more instantiation of WysiwygEditingRenderer, the appropiate renderer

[juanpablo] 2.10.3-git-41

------------------------------------------
[...truncated 1.10 MB...]
  DefaultPluginManagerTest.setUp:54 » Wiki JSPWiki: Unable to load and setup pro...
  DefaultPluginManagerTest.setUp:54 » Wiki JSPWiki: Unable to load and setup pro...
  DefaultPluginManagerTest.setUp:54 » Wiki JSPWiki: Unable to load and setup pro...
  DefaultPluginManagerTest.setUp:54 » Wiki JSPWiki: Unable to load and setup pro...
  DefaultPluginManagerTest.setUp:54 » Wiki JSPWiki: Unable to load and setup pro...
  DefaultPluginManagerTest.setUp:54 » Wiki JSPWiki: Unable to load and setup pro...
  DefaultPluginManagerTest.setUp:54 » Wiki JSPWiki: Unable to load and setup pro...
  GroupsTest.setUp:43 » Wiki JSPWiki: Unable to load and setup properties from j...
  IfPluginTest.setUp:49 » Wiki JSPWiki: Unable to load and setup properties from...
  IfPluginTest.setUp:49 » Wiki JSPWiki: Unable to load and setup properties from...
  IfPluginTest.setUp:49 » Wiki JSPWiki: Unable to load and setup properties from...
  IfPluginTest.setUp:49 » Wiki JSPWiki: Unable to load and setup properties from...
  InsertPageTest.setUp:36 » Wiki JSPWiki: Unable to load and setup properties fr...
  InsertPageTest.setUp:36 » Wiki JSPWiki: Unable to load and setup properties fr...
  InsertPageTest.setUp:36 » Wiki JSPWiki: Unable to load and setup properties fr...
  InsertPageTest.setUp:36 » Wiki JSPWiki: Unable to load and setup properties fr...
  InsertPageTest.setUp:36 » Wiki JSPWiki: Unable to load and setup properties fr...
  InsertPageTest.setUp:36 » Wiki JSPWiki: Unable to load and setup properties fr...
  PageViewPluginTest.setUp:52 » Wiki JSPWiki: Unable to load and setup propertie...
  PageViewPluginTest.setUp:52 » Wiki JSPWiki: Unable to load and setup propertie...
  PageViewPluginTest.setUp:52 » Wiki JSPWiki: Unable to load and setup propertie...
  PageViewPluginTest.setUp:52 » Wiki JSPWiki: Unable to load and setup propertie...
  RecentChangesPluginTest.setUp:45 » Wiki JSPWiki: Unable to load and setup prop...
  RecentChangesPluginTest.setUp:45 » Wiki JSPWiki: Unable to load and setup prop...
  RecentChangesPluginTest.setUp:45 » Wiki JSPWiki: Unable to load and setup prop...
  RecentChangesPluginTest.setUp:45 » Wiki JSPWiki: Unable to load and setup prop...
  ReferringPagesPluginTest.setUp:51 » Wiki JSPWiki: Unable to load and setup pro...
  ReferringPagesPluginTest.setUp:51 » Wiki JSPWiki: Unable to load and setup pro...
  ReferringPagesPluginTest.setUp:51 » Wiki JSPWiki: Unable to load and setup pro...
  ReferringPagesPluginTest.setUp:51 » Wiki JSPWiki: Unable to load and setup pro...
  ReferringPagesPluginTest.setUp:51 » Wiki JSPWiki: Unable to load and setup pro...
  ReferringPagesPluginTest.setUp:51 » Wiki JSPWiki: Unable to load and setup pro...
  ReferringPagesPluginTest.setUp:51 » Wiki JSPWiki: Unable to load and setup pro...
  ReferringPagesPluginTest.setUp:51 » Wiki JSPWiki: Unable to load and setup pro...
  ReferringUndefinedPagesPluginTest.setUp:45 » Wiki JSPWiki: Unable to load and ...
  ReferringUndefinedPagesPluginTest.setUp:45 » Wiki JSPWiki: Unable to load and ...
  ReferringUndefinedPagesPluginTest.setUp:45 » Wiki JSPWiki: Unable to load and ...
  ReferringUndefinedPagesPluginTest.setUp:45 » Wiki JSPWiki: Unable to load and ...
  TableOfContentsTest.setUp:53 » Wiki JSPWiki: Unable to load and setup properti...
  TableOfContentsTest.setUp:53 » Wiki JSPWiki: Unable to load and setup properti...
  TableOfContentsTest.setUp:53 » Wiki JSPWiki: Unable to load and setup properti...
  TableOfContentsTest.setUp:53 » Wiki JSPWiki: Unable to load and setup properti...
  TableOfContentsTest.setUp:53 » Wiki JSPWiki: Unable to load and setup properti...
  TableOfContentsTest.setUp:53 » Wiki JSPWiki: Unable to load and setup properti...
  TableOfContentsTest.setUp:53 » Wiki JSPWiki: Unable to load and setup properti...
  TableOfContentsTest.setUp:53 » Wiki JSPWiki: Unable to load and setup properti...
  UndefinedPagesPluginTest.setUp:51 » Wiki JSPWiki: Unable to load and setup pro...
  UndefinedPagesPluginTest.setUp:51 » Wiki JSPWiki: Unable to load and setup pro...
  BasicAttachmentProviderTest.setUp:63 » Wiki JSPWiki: Unable to load and setup ...
  BasicAttachmentProviderTest.setUp:63 » Wiki JSPWiki: Unable to load and setup ...
  BasicAttachmentProviderTest.setUp:63 » Wiki JSPWiki: Unable to load and setup ...
  BasicAttachmentProviderTest.setUp:63 » Wiki JSPWiki: Unable to load and setup ...
  BasicAttachmentProviderTest.setUp:63 » Wiki JSPWiki: Unable to load and setup ...
  BasicAttachmentProviderTest.setUp:63 » Wiki JSPWiki: Unable to load and setup ...
  BasicAttachmentProviderTest.setUp:63 » Wiki JSPWiki: Unable to load and setup ...
  BasicAttachmentProviderTest.setUp:63 » Wiki JSPWiki: Unable to load and setup ...
  BasicAttachmentProviderTest.setUp:63 » Wiki JSPWiki: Unable to load and setup ...
  BasicAttachmentProviderTest.setUp:63 » Wiki JSPWiki: Unable to load and setup ...
  BasicAttachmentProviderTest.setUp:63 » Wiki JSPWiki: Unable to load and setup ...
  BasicAttachmentProviderTest.setUp:63 » Wiki JSPWiki: Unable to load and setup ...
  CachingProviderTest.setUp:54 » Wiki JSPWiki: Unable to load and setup properti...
  CachingProviderTest.setUp:54 » Wiki JSPWiki: Unable to load and setup properti...
  FileSystemProviderTest.setUp:61 » Wiki JSPWiki: Unable to load and setup prope...
  FileSystemProviderTest.setUp:61 » Wiki JSPWiki: Unable to load and setup prope...
  FileSystemProviderTest.setUp:61 » Wiki JSPWiki: Unable to load and setup prope...
  FileSystemProviderTest.setUp:61 » Wiki JSPWiki: Unable to load and setup prope...
  FileSystemProviderTest.setUp:61 » Wiki JSPWiki: Unable to load and setup prope...
  FileSystemProviderTest.setUp:61 » Wiki JSPWiki: Unable to load and setup prope...
  FileSystemProviderTest.setUp:61 » Wiki JSPWiki: Unable to load and setup prope...
  FileSystemProviderTest.setUp:61 » Wiki JSPWiki: Unable to load and setup prope...
  FileSystemProviderTest.setUp:61 » Wiki JSPWiki: Unable to load and setup prope...
  FileSystemProviderTest.setUp:61 » Wiki JSPWiki: Unable to load and setup prope...
  VersioningFileProviderTest.setUp:79 » Wiki JSPWiki: Unable to load and setup p...
  VersioningFileProviderTest.setUp:79 » Wiki JSPWiki: Unable to load and setup p...
  VersioningFileProviderTest.setUp:79 » Wiki JSPWiki: Unable to load and setup p...
  VersioningFileProviderTest.setUp:79 » Wiki JSPWiki: Unable to load and setup p...
  VersioningFileProviderTest.setUp:79 » Wiki JSPWiki: Unable to load and setup p...
  VersioningFileProviderTest.setUp:79 » Wiki JSPWiki: Unable to load and setup p...
  VersioningFileProviderTest.setUp:79 » Wiki JSPWiki: Unable to load and setup p...
  VersioningFileProviderTest.setUp:79 » Wiki JSPWiki: Unable to load and setup p...
  VersioningFileProviderTest.setUp:79 » Wiki JSPWiki: Unable to load and setup p...
  VersioningFileProviderTest.setUp:79 » Wiki JSPWiki: Unable to load and setup p...
  VersioningFileProviderTest.setUp:79 » Wiki JSPWiki: Unable to load and setup p...
  VersioningFileProviderTest.setUp:79 » Wiki JSPWiki: Unable to load and setup p...
  VersioningFileProviderTest.setUp:79 » Wiki JSPWiki: Unable to load and setup p...
  VersioningFileProviderTest.setUp:79 » Wiki JSPWiki: Unable to load and setup p...
  VersioningFileProviderTest.setUp:79 » Wiki JSPWiki: Unable to load and setup p...
  VersioningFileProviderTest.setUp:79 » Wiki JSPWiki: Unable to load and setup p...
  VersioningFileProviderTest.setUp:79 » Wiki JSPWiki: Unable to load and setup p...
  VersioningFileProviderTest.setUp:79 » Wiki JSPWiki: Unable to load and setup p...
  VersioningFileProviderTest.setUp:79 » Wiki JSPWiki: Unable to load and setup p...
  VersioningFileProviderTest.setUp:79 » Wiki JSPWiki: Unable to load and setup p...
  CreoleRendererTest.setUp:42 » Wiki JSPWiki: Unable to load and setup propertie...
  CreoleRendererTest.setUp:42 » Wiki JSPWiki: Unable to load and setup propertie...
  CreoleRendererTest.setUp:42 » Wiki JSPWiki: Unable to load and setup propertie...
  CreoleRendererTest.setUp:42 » Wiki JSPWiki: Unable to load and setup propertie...
  CreoleRendererTest.setUp:42 » Wiki JSPWiki: Unable to load and setup propertie...
  CreoleRendererTest.setUp:42 » Wiki JSPWiki: Unable to load and setup propertie...
  CreoleRendererTest.setUp:42 » Wiki JSPWiki: Unable to load and setup propertie...
  CreoleRendererTest.setUp:42 » Wiki JSPWiki: Unable to load and setup propertie...
  CreoleRendererTest.setUp:42 » Wiki JSPWiki: Unable to load and setup propertie...
  CreoleRendererTest.setUp:42 » Wiki JSPWiki: Unable to load and setup propertie...
  CreoleRendererTest.setUp:42 » Wiki JSPWiki: Unable to load and setup propertie...
  CreoleRendererTest.setUp:42 » Wiki JSPWiki: Unable to load and setup propertie...
  CreoleRendererTest.setUp:42 » Wiki JSPWiki: Unable to load and setup propertie...
  CreoleRendererTest.setUp:42 » Wiki JSPWiki: Unable to load and setup propertie...
  RenderingManagerTest.setUp:43 » Wiki JSPWiki: Unable to load and setup propert...
  WysiwygEditingRendererTest.setUp:42 » Wiki JSPWiki: Unable to load and setup p...
  WysiwygEditingRendererTest.setUp:42 » Wiki JSPWiki: Unable to load and setup p...
  RSSGeneratorTest.setUp:60 » Wiki JSPWiki: Unable to load and setup properties ...
  RSSGeneratorTest.setUp:60 » Wiki JSPWiki: Unable to load and setup properties ...
  SearchManagerTest.setUp:53 » Wiki JSPWiki: Unable to load and setup properties...
  SearchManagerTest.setUp:53 » Wiki JSPWiki: Unable to load and setup properties...
  SearchManagerTest.setUp:53 » Wiki JSPWiki: Unable to load and setup properties...
  SearchManagerTest.setUp:53 » Wiki JSPWiki: Unable to load and setup properties...
  SearchManagerTest.setUp:53 » Wiki JSPWiki: Unable to load and setup properties...
  SearchManagerTest.setUp:53 » Wiki JSPWiki: Unable to load and setup properties...
  SearchManagerTest.setUp:53 » Wiki JSPWiki: Unable to load and setup properties...
  CommandResolverTest.setUp:48 » Wiki JSPWiki: Unable to load and setup properti...
  CommandResolverTest.setUp:48 » Wiki JSPWiki: Unable to load and setup properti...
  CommandResolverTest.setUp:48 » Wiki JSPWiki: Unable to load and setup properti...
  CommandResolverTest.setUp:48 » Wiki JSPWiki: Unable to load and setup properti...
  CommandResolverTest.setUp:48 » Wiki JSPWiki: Unable to load and setup properti...
  CommandResolverTest.setUp:48 » Wiki JSPWiki: Unable to load and setup properti...
  GroupCommandTest.setUp:40 » Wiki JSPWiki: Unable to load and setup properties ...
  GroupCommandTest.setUp:40 » Wiki JSPWiki: Unable to load and setup properties ...
  InputValidatorTest.setUp:47 » Wiki JSPWiki: Unable to load and setup propertie...
  InputValidatorTest.setUp:47 » Wiki JSPWiki: Unable to load and setup propertie...
  InputValidatorTest.setUp:47 » Wiki JSPWiki: Unable to load and setup propertie...
  InputValidatorTest.setUp:47 » Wiki JSPWiki: Unable to load and setup propertie...
  PageCommandTest.setUp:44 » Wiki JSPWiki: Unable to load and setup properties f...
  PageCommandTest.setUp:44 » Wiki JSPWiki: Unable to load and setup properties f...
  WikiCommandTest.setUp:42 » Wiki JSPWiki: Unable to load and setup properties f...
  WikiCommandTest.setUp:42 » Wiki JSPWiki: Unable to load and setup properties f...
  PluginBeanTest.testDoGet:40 » Wiki JSPWiki: Unable to load and setup propertie...
  DefaultURLConstructorTest.testAttachURL1:122->getConstructor:47 » Wiki JSPWiki...
  DefaultURLConstructorTest.testAttachURLRelative1:130->getConstructor:47 » Wiki
  DefaultURLConstructorTest.testEditURL1:114->getConstructor:47 » Wiki JSPWiki: ...
  DefaultURLConstructorTest.testOtherURL1:138->getConstructor:47 » Wiki JSPWiki:...
  DefaultURLConstructorTest.testOtherURL2:146->getConstructor:47 » Wiki JSPWiki:...
  DefaultURLConstructorTest.testViewURL1:58->getConstructor:47 » Wiki JSPWiki: U...
  DefaultURLConstructorTest.testViewURL2:66->getConstructor:47 » Wiki JSPWiki: U...
  DefaultURLConstructorTest.testViewURL3:74->getConstructor:47 » Wiki JSPWiki: U...
  DefaultURLConstructorTest.testViewURL4:82->getConstructor:47 » Wiki JSPWiki: U...
  DefaultURLConstructorTest.testViewURL5:90->getConstructor:47 » Wiki JSPWiki: U...
  DefaultURLConstructorTest.testViewURL6:98->getConstructor:47 » Wiki JSPWiki: U...
  DefaultURLConstructorTest.testViewURL7:106->getConstructor:47 » Wiki JSPWiki: ...
  ShortURLConstructorTest.testAttachURL1:122->getConstructor:47 » Wiki JSPWiki: ...
  ShortURLConstructorTest.testAttachURLRelative1:130->getConstructor:47 » Wiki J...
  ShortURLConstructorTest.testEditURL1:114->getConstructor:47 » Wiki JSPWiki: Un...
  ShortURLConstructorTest.testOtherURL1:138->getConstructor:47 » Wiki JSPWiki: U...
  ShortURLConstructorTest.testOtherURL2:146->getConstructor:47 » Wiki JSPWiki: U...
  ShortURLConstructorTest.testViewURL1:58->getConstructor:47 » Wiki JSPWiki: Una...
  ShortURLConstructorTest.testViewURL2:66->getConstructor:47 » Wiki JSPWiki: Una...
  ShortURLConstructorTest.testViewURL3:74->getConstructor:47 » Wiki JSPWiki: Una...
  ShortURLConstructorTest.testViewURL4:82->getConstructor:47 » Wiki JSPWiki: Una...
  ShortURLConstructorTest.testViewURL5:90->getConstructor:47 » Wiki JSPWiki: Una...
  ShortURLConstructorTest.testViewURL6:98->getConstructor:47 » Wiki JSPWiki: Una...
  ShortURLConstructorTest.testViewURL7:106->getConstructor:47 » Wiki JSPWiki: Un...
  ShortViewURLConstructorTest.testAttachURL1:122->getConstructor:47 » Wiki JSPWi...
  ShortViewURLConstructorTest.testAttachURLRelative1:130->getConstructor:47 » Wiki
  ShortViewURLConstructorTest.testEditURL1:114->getConstructor:47 » Wiki JSPWiki...
  ShortViewURLConstructorTest.testOtherURL1:138->getConstructor:47 » Wiki JSPWik...
  ShortViewURLConstructorTest.testOtherURL2:146->getConstructor:47 » Wiki JSPWik...
  ShortViewURLConstructorTest.testViewURL1:58->getConstructor:47 » Wiki JSPWiki:...
  ShortViewURLConstructorTest.testViewURL2:66->getConstructor:47 » Wiki JSPWiki:...
  ShortViewURLConstructorTest.testViewURL3:74->getConstructor:47 » Wiki JSPWiki:...
  ShortViewURLConstructorTest.testViewURL4:82->getConstructor:47 » Wiki JSPWiki:...
  ShortViewURLConstructorTest.testViewURL5:90->getConstructor:47 » Wiki JSPWiki:...
  ShortViewURLConstructorTest.testViewURL6:98->getConstructor:47 » Wiki JSPWiki:...
  ShortViewURLConstructorTest.testViewURL7:106->getConstructor:47 » Wiki JSPWiki...
  MailUtilTest.setUp:68 » Wiki JSPWiki: Unable to load and setup properties from...
  MailUtilTest.setUp:68 » Wiki JSPWiki: Unable to load and setup properties from...
  ApprovalWorkflowTest.setUp:56 » Wiki JSPWiki: Unable to load and setup propert...
  ApprovalWorkflowTest.setUp:56 » Wiki JSPWiki: Unable to load and setup propert...
  ApprovalWorkflowTest.setUp:56 » Wiki JSPWiki: Unable to load and setup propert...
  ApprovalWorkflowTest.setUp:56 » Wiki JSPWiki: Unable to load and setup propert...
  ApprovalWorkflowTest.setUp:56 » Wiki JSPWiki: Unable to load and setup propert...
  DecisionQueueTest.setUp:56 » Wiki JSPWiki: Unable to load and setup properties...
  DecisionQueueTest.setUp:56 » Wiki JSPWiki: Unable to load and setup properties...
  DecisionQueueTest.setUp:56 » Wiki JSPWiki: Unable to load and setup properties...
  DecisionQueueTest.setUp:56 » Wiki JSPWiki: Unable to load and setup properties...
  DecisionQueueTest.setUp:56 » Wiki JSPWiki: Unable to load and setup properties...
  DecisionQueueTest.setUp:56 » Wiki JSPWiki: Unable to load and setup properties...
  DecisionQueueTest.setUp:56 » Wiki JSPWiki: Unable to load and setup properties...
  OutcomeTest.testMessage:58 » Wiki JSPWiki: Unable to load and setup properties...
  WorkflowManagerTest.setUp:41 » Wiki JSPWiki: Unable to load and setup properti...
  WorkflowManagerTest.setUp:41 » Wiki JSPWiki: Unable to load and setup properti...
  WorkflowManagerTest.setUp:41 » Wiki JSPWiki: Unable to load and setup properti...
  WorkflowManagerTest.setUp:41 » Wiki JSPWiki: Unable to load and setup properti...
  RPCHandlerTest.setUp:56 » Wiki JSPWiki: Unable to load and setup properties fr...
  RPCHandlerTest.setUp:56 » Wiki JSPWiki: Unable to load and setup properties fr...
  RPCHandlerTest.setUp:56 » Wiki JSPWiki: Unable to load and setup properties fr...
  RPCHandlerTest.setUp:56 » Wiki JSPWiki: Unable to load and setup properties fr...
  RPCHandlerTest.setUp:56 » Wiki JSPWiki: Unable to load and setup properties fr...
  RPCHandlerTest.setUp:56 » Wiki JSPWiki: Unable to load and setup properties fr...

Tests run: 955, Failures: 0, Errors: 624, Skipped: 0

[INFO]                                                                         
[INFO] ------------------------------------------------------------------------
[INFO] Skipping Apache JSPWiki
[INFO] This project has been banned from the build due to previous failures.
[INFO] ------------------------------------------------------------------------
[INFO] ------------------------------------------------------------------------
[INFO] Reactor Summary:
[INFO] 
[INFO] Apache JSPWiki ..................................... SUCCESS [  5.233 s]
[INFO] Apache JSPWiki initial wiki pages builder .......... SUCCESS [  0.038 s]
[INFO] Apache JSPWiki initial wiki pages (de) ............. SUCCESS [  1.430 s]
[INFO] Apache JSPWiki initial wiki pages (en) ............. SUCCESS [  0.149 s]
[INFO] Apache JSPWiki initial wiki pages (es) ............. SUCCESS [  0.117 s]
[INFO] Apache JSPWiki initial wiki pages (fi) ............. SUCCESS [  0.061 s]
[INFO] Apache JSPWiki initial wiki pages (fr) ............. SUCCESS [  0.087 s]
[INFO] Apache JSPWiki initial wiki pages (it) ............. SUCCESS [  0.085 s]
[INFO] Apache JSPWiki initial wiki pages (nl) ............. SUCCESS [  0.085 s]
[INFO] Apache JSPWiki initial wiki pages (pt_BR) .......... SUCCESS [  0.118 s]
[INFO] Apache JSPWiki initial wiki pages (ru) ............. SUCCESS [  0.109 s]
[INFO] Apache JSPWiki initial wiki pages (zh_CN) .......... SUCCESS [  0.109 s]
[INFO] Apache JSPWiki Main War ............................ FAILURE [ 52.075 s]
[INFO] Apache JSPWiki portable ............................ SKIPPED
[INFO] jspwiki-it-builder ................................. SKIPPED
[INFO] jspwiki-selenium-tests ............................. SKIPPED
[INFO] jspwiki-it-test-custom ............................. SKIPPED
[INFO] jspwiki-it-test-custom-absolute-urls ............... SKIPPED
[INFO] jspwiki-it-test-custom-jdbc ........................ SKIPPED
[INFO] jspwiki-it-test-cma ................................ SKIPPED
[INFO] jspwiki-it-test-cma-jdbc ........................... SKIPPED
[INFO] ------------------------------------------------------------------------
[INFO] BUILD FAILURE
[INFO] ------------------------------------------------------------------------
[INFO] Total time: 01:01 min
[INFO] Finished at: 2017-08-22T18:14:17+00:00
[INFO] Final Memory: 61M/1213M
[INFO] ------------------------------------------------------------------------
[ERROR] Failed to execute goal org.apache.maven.plugins:maven-surefire-plugin:2.18.1:test
(default-test) on project jspwiki-war: There are test failures.
[ERROR] 
[ERROR] Please refer to <https://builds.apache.org/job/JSPWiki-sonarqube/ws/jspwiki-war/target/surefire-reports>
for the individual test results.
[ERROR] -> [Help 1]
[ERROR] 
[ERROR] To see the full stack trace of the errors, re-run Maven with the -e switch.
[ERROR] Re-run Maven using the -X switch to enable full debug logging.
[ERROR] 
[ERROR] For more information about the errors and possible solutions, please read the following
articles:
[ERROR] [Help 1] http://cwiki.apache.org/confluence/display/MAVEN/MojoFailureException
[ERROR] 
[ERROR] After correcting the problems, you can resume the build with the command
[ERROR]   mvn <goals> -rf :jspwiki-war
Build step 'Invoke top-level Maven targets' marked build as failure

Mime
View raw message