jspwiki-commits mailing list archives

Site index · List index
Message view « Date » · « Thread »
Top « Date » · « Thread »
From Apache Jenkins Server <jenk...@builds.apache.org>
Subject Build failed in Jenkins: JSPWiki-sonarqube #3
Date Sun, 05 Mar 2017 13:57:14 GMT
See <https://builds.apache.org/job/JSPWiki-sonarqube/3/display/redirect?page=changes>

Changes:

[harry.metske] 2.10.3-git-34

------------------------------------------
[...truncated 213.15 KB...]
[INFO] Using 'UTF-8' encoding to copy filtered resources.
[INFO] skip non existing resourceDirectory <https://builds.apache.org/job/JSPWiki-sonarqube/ws/jspwiki-it-tests/jspwiki-it-test-custom/src/test/resources>
[INFO] Copying 3 resources
[INFO] 
[INFO] --- maven-compiler-plugin:3.3:testCompile (default-testCompile) @ jspwiki-it-test-custom
---
[INFO] No sources to compile
[INFO] 
[INFO] --- maven-surefire-plugin:2.18.1:test (default-test) @ jspwiki-it-test-custom ---
[INFO] 
[INFO] --- maven-war-plugin:2.6:war (default-war) @ jspwiki-it-test-custom ---
[INFO] Packaging webapp
[INFO] Assembling webapp [jspwiki-it-test-custom] in [<https://builds.apache.org/job/JSPWiki-sonarqube/ws/jspwiki-it-tests/jspwiki-it-test-custom/target/jspwiki-it-test-custom]>
[INFO] Processing war project
[INFO] Copying webapp resources [<https://builds.apache.org/job/JSPWiki-sonarqube/ws/jspwiki-it-tests/jspwiki-it-test-custom/src/main/webapp]>
[INFO] Building jar: <https://builds.apache.org/job/JSPWiki-sonarqube/ws/jspwiki-it-tests/jspwiki-it-test-custom/target/jspwiki-it-test-custom/WEB-INF/lib/jspwiki-it-test-custom-2.10.3-SNAPSHOT.jar>
[INFO] Webapp assembled in [35 msecs]
[INFO] Building war: <https://builds.apache.org/job/JSPWiki-sonarqube/ws/jspwiki-it-tests/jspwiki-it-test-custom/target/jspwiki-it-test-custom.war>
[INFO] 
[INFO] --- maven-site-plugin:3.4:attach-descriptor (attach-descriptor) @ jspwiki-it-test-custom
---
[INFO]                                                                         
[INFO] ------------------------------------------------------------------------
[INFO] Building jspwiki-it-test-custom-absolute-urls 2.10.3-SNAPSHOT
[INFO] ------------------------------------------------------------------------
[INFO] 
[INFO] --- maven-clean-plugin:2.6.1:clean (default-clean) @ jspwiki-it-test-custom-absolute-urls
---
[INFO] Deleting <https://builds.apache.org/job/JSPWiki-sonarqube/ws/jspwiki-it-tests/jspwiki-it-test-custom-absolute-urls/target>
[INFO] 
[INFO] --- maven-enforcer-plugin:1.4:enforce (enforcer-validations) @ jspwiki-it-test-custom-absolute-urls
---
[INFO] 
[INFO] --- maven-remote-resources-plugin:1.5:process (default) @ jspwiki-it-test-custom-absolute-urls
---
[INFO] 
[INFO] --- maven-resources-plugin:2.7:resources (default-resources) @ jspwiki-it-test-custom-absolute-urls
---
[INFO] Using 'UTF-8' encoding to copy filtered resources.
[INFO] skip non existing resourceDirectory <https://builds.apache.org/job/JSPWiki-sonarqube/ws/jspwiki-it-tests/jspwiki-it-test-custom-absolute-urls/src/main/resources>
[INFO] Copying 3 resources
[INFO] 
[INFO] --- maven-compiler-plugin:3.3:compile (default-compile) @ jspwiki-it-test-custom-absolute-urls
---
[INFO] No sources to compile
[INFO] 
[INFO] --- maven-resources-plugin:2.7:testResources (default-testResources) @ jspwiki-it-test-custom-absolute-urls
---
[INFO] Using 'UTF-8' encoding to copy filtered resources.
[INFO] skip non existing resourceDirectory <https://builds.apache.org/job/JSPWiki-sonarqube/ws/jspwiki-it-tests/jspwiki-it-test-custom-absolute-urls/src/test/resources>
[INFO] Copying 3 resources
[INFO] 
[INFO] --- maven-compiler-plugin:3.3:testCompile (default-testCompile) @ jspwiki-it-test-custom-absolute-urls
---
[INFO] No sources to compile
[INFO] 
[INFO] --- maven-surefire-plugin:2.18.1:test (default-test) @ jspwiki-it-test-custom-absolute-urls
---
[INFO] 
[INFO] --- maven-war-plugin:2.6:war (default-war) @ jspwiki-it-test-custom-absolute-urls ---
[INFO] Packaging webapp
[INFO] Assembling webapp [jspwiki-it-test-custom-absolute-urls] in [<https://builds.apache.org/job/JSPWiki-sonarqube/ws/jspwiki-it-tests/jspwiki-it-test-custom-absolute-urls/target/jspwiki-it-test-custom-absolute-urls]>
[INFO] Processing war project
[INFO] Copying webapp resources [<https://builds.apache.org/job/JSPWiki-sonarqube/ws/jspwiki-it-tests/jspwiki-it-test-custom-absolute-urls/src/main/webapp]>
[INFO] Building jar: <https://builds.apache.org/job/JSPWiki-sonarqube/ws/jspwiki-it-tests/jspwiki-it-test-custom-absolute-urls/target/jspwiki-it-test-custom-absolute-urls/WEB-INF/lib/jspwiki-it-test-custom-absolute-urls-2.10.3-SNAPSHOT.jar>
[INFO] Webapp assembled in [58 msecs]
[INFO] Building war: <https://builds.apache.org/job/JSPWiki-sonarqube/ws/jspwiki-it-tests/jspwiki-it-test-custom-absolute-urls/target/jspwiki-it-test-custom-absolute-urls.war>
[INFO] 
[INFO] --- maven-site-plugin:3.4:attach-descriptor (attach-descriptor) @ jspwiki-it-test-custom-absolute-urls
---
[INFO]                                                                         
[INFO] ------------------------------------------------------------------------
[INFO] Building jspwiki-it-test-custom-jdbc 2.10.3-SNAPSHOT
[INFO] ------------------------------------------------------------------------
[INFO] 
[INFO] --- maven-clean-plugin:2.6.1:clean (default-clean) @ jspwiki-it-test-custom-jdbc ---
[INFO] Deleting <https://builds.apache.org/job/JSPWiki-sonarqube/ws/jspwiki-it-tests/jspwiki-it-test-custom-jdbc/target>
[INFO] 
[INFO] --- maven-enforcer-plugin:1.4:enforce (enforcer-validations) @ jspwiki-it-test-custom-jdbc
---
[INFO] 
[INFO] --- maven-remote-resources-plugin:1.5:process (default) @ jspwiki-it-test-custom-jdbc
---
[INFO] 
[INFO] --- maven-resources-plugin:2.7:resources (default-resources) @ jspwiki-it-test-custom-jdbc
---
[INFO] Using 'UTF-8' encoding to copy filtered resources.
[INFO] skip non existing resourceDirectory <https://builds.apache.org/job/JSPWiki-sonarqube/ws/jspwiki-it-tests/jspwiki-it-test-custom-jdbc/src/main/resources>
[INFO] Copying 3 resources
[INFO] 
[INFO] --- maven-compiler-plugin:3.3:compile (default-compile) @ jspwiki-it-test-custom-jdbc
---
[INFO] No sources to compile
[INFO] 
[INFO] --- maven-resources-plugin:2.7:testResources (default-testResources) @ jspwiki-it-test-custom-jdbc
---
[INFO] Using 'UTF-8' encoding to copy filtered resources.
[INFO] skip non existing resourceDirectory <https://builds.apache.org/job/JSPWiki-sonarqube/ws/jspwiki-it-tests/jspwiki-it-test-custom-jdbc/src/test/resources>
[INFO] Copying 3 resources
[INFO] 
[INFO] --- maven-compiler-plugin:3.3:testCompile (default-testCompile) @ jspwiki-it-test-custom-jdbc
---
[INFO] No sources to compile
[INFO] 
[INFO] --- maven-surefire-plugin:2.18.1:test (default-test) @ jspwiki-it-test-custom-jdbc
---
[INFO] 
[INFO] --- maven-war-plugin:2.6:war (default-war) @ jspwiki-it-test-custom-jdbc ---
[INFO] Packaging webapp
[INFO] Assembling webapp [jspwiki-it-test-custom-jdbc] in [<https://builds.apache.org/job/JSPWiki-sonarqube/ws/jspwiki-it-tests/jspwiki-it-test-custom-jdbc/target/jspwiki-it-test-custom-jdbc]>
[INFO] Processing war project
[INFO] Copying webapp resources [<https://builds.apache.org/job/JSPWiki-sonarqube/ws/jspwiki-it-tests/jspwiki-it-test-custom-jdbc/src/main/webapp]>
[INFO] Building jar: <https://builds.apache.org/job/JSPWiki-sonarqube/ws/jspwiki-it-tests/jspwiki-it-test-custom-jdbc/target/jspwiki-it-test-custom-jdbc/WEB-INF/lib/jspwiki-it-test-custom-jdbc-2.10.3-SNAPSHOT.jar>
[INFO] Webapp assembled in [28 msecs]
[INFO] Building war: <https://builds.apache.org/job/JSPWiki-sonarqube/ws/jspwiki-it-tests/jspwiki-it-test-custom-jdbc/target/jspwiki-it-test-custom-jdbc.war>
[INFO] 
[INFO] --- maven-site-plugin:3.4:attach-descriptor (attach-descriptor) @ jspwiki-it-test-custom-jdbc
---
[INFO]                                                                         
[INFO] ------------------------------------------------------------------------
[INFO] Building jspwiki-it-test-cma 2.10.3-SNAPSHOT
[INFO] ------------------------------------------------------------------------
[INFO] 
[INFO] --- maven-clean-plugin:2.6.1:clean (default-clean) @ jspwiki-it-test-cma ---
[INFO] Deleting <https://builds.apache.org/job/JSPWiki-sonarqube/ws/jspwiki-it-tests/jspwiki-it-test-cma/target>
[INFO] 
[INFO] --- maven-enforcer-plugin:1.4:enforce (enforcer-validations) @ jspwiki-it-test-cma
---
[INFO] 
[INFO] --- maven-remote-resources-plugin:1.5:process (default) @ jspwiki-it-test-cma ---
[INFO] 
[INFO] --- maven-resources-plugin:2.7:resources (default-resources) @ jspwiki-it-test-cma
---
[INFO] Using 'UTF-8' encoding to copy filtered resources.
[INFO] skip non existing resourceDirectory <https://builds.apache.org/job/JSPWiki-sonarqube/ws/jspwiki-it-tests/jspwiki-it-test-cma/src/main/resources>
[INFO] Copying 3 resources
[INFO] 
[INFO] --- maven-compiler-plugin:3.3:compile (default-compile) @ jspwiki-it-test-cma ---
[INFO] No sources to compile
[INFO] 
[INFO] --- maven-resources-plugin:2.7:testResources (default-testResources) @ jspwiki-it-test-cma
---
[INFO] Using 'UTF-8' encoding to copy filtered resources.
[INFO] skip non existing resourceDirectory <https://builds.apache.org/job/JSPWiki-sonarqube/ws/jspwiki-it-tests/jspwiki-it-test-cma/src/test/resources>
[INFO] Copying 3 resources
[INFO] 
[INFO] --- maven-compiler-plugin:3.3:testCompile (default-testCompile) @ jspwiki-it-test-cma
---
[INFO] No sources to compile
[INFO] 
[INFO] --- maven-surefire-plugin:2.18.1:test (default-test) @ jspwiki-it-test-cma ---
[INFO] 
[INFO] --- maven-war-plugin:2.6:war (default-war) @ jspwiki-it-test-cma ---
[INFO] Packaging webapp
[INFO] Assembling webapp [jspwiki-it-test-cma] in [<https://builds.apache.org/job/JSPWiki-sonarqube/ws/jspwiki-it-tests/jspwiki-it-test-cma/target/jspwiki-it-test-cma]>
[INFO] Processing war project
[INFO] Copying webapp resources [<https://builds.apache.org/job/JSPWiki-sonarqube/ws/jspwiki-it-tests/jspwiki-it-test-cma/src/main/webapp]>
[INFO] Building jar: <https://builds.apache.org/job/JSPWiki-sonarqube/ws/jspwiki-it-tests/jspwiki-it-test-cma/target/jspwiki-it-test-cma/WEB-INF/lib/jspwiki-it-test-cma-2.10.3-SNAPSHOT.jar>
[INFO] Webapp assembled in [91 msecs]
[INFO] Building war: <https://builds.apache.org/job/JSPWiki-sonarqube/ws/jspwiki-it-tests/jspwiki-it-test-cma/target/jspwiki-it-test-cma.war>
[INFO] 
[INFO] --- maven-site-plugin:3.4:attach-descriptor (attach-descriptor) @ jspwiki-it-test-cma
---
[INFO]                                                                         
[INFO] ------------------------------------------------------------------------
[INFO] Building jspwiki-it-test-cma-jdbc 2.10.3-SNAPSHOT
[INFO] ------------------------------------------------------------------------
[INFO] 
[INFO] --- maven-clean-plugin:2.6.1:clean (default-clean) @ jspwiki-it-test-cma-jdbc ---
[INFO] Deleting <https://builds.apache.org/job/JSPWiki-sonarqube/ws/jspwiki-it-tests/jspwiki-it-test-cma-jdbc/target>
[INFO] 
[INFO] --- maven-enforcer-plugin:1.4:enforce (enforcer-validations) @ jspwiki-it-test-cma-jdbc
---
[INFO] 
[INFO] --- maven-remote-resources-plugin:1.5:process (default) @ jspwiki-it-test-cma-jdbc
---
[INFO] 
[INFO] --- maven-resources-plugin:2.7:resources (default-resources) @ jspwiki-it-test-cma-jdbc
---
[INFO] Using 'UTF-8' encoding to copy filtered resources.
[INFO] Copying 1 resource
[INFO] Copying 3 resources
[INFO] 
[INFO] --- maven-compiler-plugin:3.3:compile (default-compile) @ jspwiki-it-test-cma-jdbc
---
[INFO] No sources to compile
[INFO] 
[INFO] --- maven-resources-plugin:2.7:testResources (default-testResources) @ jspwiki-it-test-cma-jdbc
---
[INFO] Using 'UTF-8' encoding to copy filtered resources.
[INFO] skip non existing resourceDirectory <https://builds.apache.org/job/JSPWiki-sonarqube/ws/jspwiki-it-tests/jspwiki-it-test-cma-jdbc/src/test/resources>
[INFO] Copying 3 resources
[INFO] 
[INFO] --- maven-compiler-plugin:3.3:testCompile (default-testCompile) @ jspwiki-it-test-cma-jdbc
---
[INFO] No sources to compile
[INFO] 
[INFO] --- maven-surefire-plugin:2.18.1:test (default-test) @ jspwiki-it-test-cma-jdbc ---
[INFO] 
[INFO] --- maven-war-plugin:2.6:war (default-war) @ jspwiki-it-test-cma-jdbc ---
[INFO] Packaging webapp
[INFO] Assembling webapp [jspwiki-it-test-cma-jdbc] in [<https://builds.apache.org/job/JSPWiki-sonarqube/ws/jspwiki-it-tests/jspwiki-it-test-cma-jdbc/target/jspwiki-it-test-cma-jdbc]>
[INFO] Processing war project
[INFO] Copying webapp resources [<https://builds.apache.org/job/JSPWiki-sonarqube/ws/jspwiki-it-tests/jspwiki-it-test-cma-jdbc/src/main/webapp]>
[INFO] Building jar: <https://builds.apache.org/job/JSPWiki-sonarqube/ws/jspwiki-it-tests/jspwiki-it-test-cma-jdbc/target/jspwiki-it-test-cma-jdbc/WEB-INF/lib/jspwiki-it-test-cma-jdbc-2.10.3-SNAPSHOT.jar>
[INFO] Webapp assembled in [24 msecs]
[INFO] Building war: <https://builds.apache.org/job/JSPWiki-sonarqube/ws/jspwiki-it-tests/jspwiki-it-test-cma-jdbc/target/jspwiki-it-test-cma-jdbc.war>
[INFO] 
[INFO] --- maven-site-plugin:3.4:attach-descriptor (attach-descriptor) @ jspwiki-it-test-cma-jdbc
---
[INFO]                                                                         
[INFO] ------------------------------------------------------------------------
[INFO] Building Apache JSPWiki 2.10.3-SNAPSHOT
[INFO] ------------------------------------------------------------------------
[INFO] 
[INFO] --- sonar-maven-plugin:2.6:sonar (default-cli) @ jspwiki-builder ---
[INFO] SonarQube version: 5.6.3
INFO: Default locale: "en_US", source code encoding: "UTF-8"
INFO: Work directory: <https://builds.apache.org/job/JSPWiki-sonarqube/ws/target/sonar>
INFO: SonarQube Server 5.6.3
[INFO] ------------------------------------------------------------------------
[INFO] Reactor Summary:
[INFO] 
[INFO] Apache JSPWiki .................................... FAILURE [0.985s]
[INFO] Apache JSPWiki initial wiki pages builder ......... SUCCESS [0.030s]
[INFO] Apache JSPWiki initial wiki pages (de) ............ SUCCESS [1.154s]
[INFO] Apache JSPWiki initial wiki pages (en) ............ SUCCESS [0.221s]
[INFO] Apache JSPWiki initial wiki pages (es) ............ SUCCESS [0.211s]
[INFO] Apache JSPWiki initial wiki pages (fi) ............ SUCCESS [0.148s]
[INFO] Apache JSPWiki initial wiki pages (fr) ............ SUCCESS [0.195s]
[INFO] Apache JSPWiki initial wiki pages (it) ............ SUCCESS [0.218s]
[INFO] Apache JSPWiki initial wiki pages (nl) ............ SUCCESS [0.189s]
[INFO] Apache JSPWiki initial wiki pages (pt_BR) ......... SUCCESS [0.223s]
[INFO] Apache JSPWiki initial wiki pages (ru) ............ SUCCESS [0.160s]
[INFO] Apache JSPWiki initial wiki pages (zh_CN) ......... SUCCESS [0.142s]
[INFO] Apache JSPWiki Main War ........................... SUCCESS [2:44.089s]
[INFO] Apache JSPWiki portable ........................... SUCCESS [6.936s]
[INFO] jspwiki-it-builder ................................ SUCCESS [0.016s]
[INFO] jspwiki-selenium-tests ............................ SUCCESS [1.701s]
[INFO] jspwiki-it-test-custom ............................ SUCCESS [0.104s]
[INFO] jspwiki-it-test-custom-absolute-urls .............. SUCCESS [0.135s]
[INFO] jspwiki-it-test-custom-jdbc ....................... SUCCESS [0.107s]
[INFO] jspwiki-it-test-cma ............................... SUCCESS [0.165s]
[INFO] jspwiki-it-test-cma-jdbc .......................... SUCCESS [0.105s]
[INFO] ------------------------------------------------------------------------
[INFO] BUILD FAILURE
[INFO] ------------------------------------------------------------------------
[INFO] Total time: 2:59.586s
[INFO] Finished at: Sun Mar 05 13:57:12 UTC 2017
[INFO] Final Memory: 119M/9004M
[INFO] ------------------------------------------------------------------------
[ERROR] Failed to execute goal org.codehaus.mojo:sonar-maven-plugin:2.6:sonar (default-cli)
on project jspwiki-builder: Execution default-cli of goal org.codehaus.mojo:sonar-maven-plugin:2.6:sonar
failed: An API incompatibility was encountered while executing org.codehaus.mojo:sonar-maven-plugin:2.6:sonar:
java.lang.UnsupportedClassVersionError: org/sonar/api/utils/SonarException : Unsupported major.minor
version 52.0
[ERROR] -----------------------------------------------------
[ERROR] realm =    plugin>org.codehaus.mojo:sonar-maven-plugin:2.6
[ERROR] strategy = org.codehaus.plexus.classworlds.strategy.SelfFirstStrategy
[ERROR] urls[0] = file:/home/jenkins/.m2/repository/org/codehaus/mojo/sonar-maven-plugin/2.6/sonar-maven-plugin-2.6.jar
[ERROR] urls[1] = file:/home/jenkins/.m2/repository/org/apache/maven/shared/maven-dependency-tree/2.1/maven-dependency-tree-2.1.jar
[ERROR] urls[2] = file:/home/jenkins/.m2/repository/backport-util-concurrent/backport-util-concurrent/3.1/backport-util-concurrent-3.1.jar
[ERROR] urls[3] = file:/home/jenkins/.m2/repository/org/codehaus/plexus/plexus-interpolation/1.11/plexus-interpolation-1.11.jar
[ERROR] urls[4] = file:/home/jenkins/.m2/repository/org/codehaus/plexus/plexus-component-annotations/1.5.5/plexus-component-annotations-1.5.5.jar
[ERROR] urls[5] = file:/home/jenkins/.m2/repository/org/eclipse/aether/aether-util/0.9.0.M2/aether-util-0.9.0.M2.jar
[ERROR] urls[6] = file:/home/jenkins/.m2/repository/org/sonatype/plexus/plexus-sec-dispatcher/1.4/plexus-sec-dispatcher-1.4.jar
[ERROR] urls[7] = file:/home/jenkins/.m2/repository/org/codehaus/plexus/plexus-utils/1.5.5/plexus-utils-1.5.5.jar
[ERROR] urls[8] = file:/home/jenkins/.m2/repository/org/sonatype/plexus/plexus-cipher/1.4/plexus-cipher-1.4.jar
[ERROR] urls[9] = file:/home/jenkins/.m2/repository/org/codehaus/sonar/runner/sonar-runner-api/2.4/sonar-runner-api-2.4.jar
[ERROR] urls[10] = file:/home/jenkins/.m2/repository/commons-lang/commons-lang/2.6/commons-lang-2.6.jar
[ERROR] urls[11] = file:/home/jenkins/.m2/repository/com/google/guava/guava/10.0.1/guava-10.0.1.jar
[ERROR] urls[12] = file:/home/jenkins/.m2/repository/com/google/code/findbugs/jsr305/2.0.3/jsr305-2.0.3.jar
[ERROR] Number of foreign imports: 1
[ERROR] import: Entry[import  from realm ClassRealm[maven.api, parent: null]]
[ERROR] 
[ERROR] -----------------------------------------------------
[ERROR] -> [Help 1]
[ERROR] 
[ERROR] To see the full stack trace of the errors, re-run Maven with the -e switch.
[ERROR] Re-run Maven using the -X switch to enable full debug logging.
[ERROR] 
[ERROR] For more information about the errors and possible solutions, please read the following
articles:
[ERROR] [Help 1] http://cwiki.apache.org/confluence/display/MAVEN/PluginContainerException
Build step 'Invoke top-level Maven targets' marked build as failure

Mime
View raw message