jspwiki-commits mailing list archives

Site index · List index
Message view « Date » · « Thread »
Top « Date » · « Thread »
From Apache Jenkins Server <jenk...@builds.apache.org>
Subject Build failed in Jenkins: JSPWiki-sonarqube #2
Date Fri, 03 Mar 2017 19:57:37 GMT
See <https://builds.apache.org/job/JSPWiki-sonarqube/2/display/redirect?page=changes>

Changes:

[harry.metske] 2017-03-03  Harry Metske (metskem@apache.org)

------------------------------------------
[...truncated 213.18 KB...]
[INFO] --- maven-compiler-plugin:3.3:testCompile (default-testCompile) @ jspwiki-it-test-custom
---
[INFO] No sources to compile
[INFO] 
[INFO] --- maven-surefire-plugin:2.18.1:test (default-test) @ jspwiki-it-test-custom ---
[INFO] 
[INFO] --- maven-war-plugin:2.6:war (default-war) @ jspwiki-it-test-custom ---
[INFO] Packaging webapp
[INFO] Assembling webapp [jspwiki-it-test-custom] in [<https://builds.apache.org/job/JSPWiki-sonarqube/ws/jspwiki-it-tests/jspwiki-it-test-custom/target/jspwiki-it-test-custom]>
[INFO] Processing war project
[INFO] Copying webapp resources [<https://builds.apache.org/job/JSPWiki-sonarqube/ws/jspwiki-it-tests/jspwiki-it-test-custom/src/main/webapp]>
[INFO] Building jar: <https://builds.apache.org/job/JSPWiki-sonarqube/ws/jspwiki-it-tests/jspwiki-it-test-custom/target/jspwiki-it-test-custom/WEB-INF/lib/jspwiki-it-test-custom-2.10.3-SNAPSHOT.jar>
[INFO] Webapp assembled in [30 msecs]
[INFO] Building war: <https://builds.apache.org/job/JSPWiki-sonarqube/ws/jspwiki-it-tests/jspwiki-it-test-custom/target/jspwiki-it-test-custom.war>
[INFO] 
[INFO] --- maven-site-plugin:3.4:attach-descriptor (attach-descriptor) @ jspwiki-it-test-custom
---
[INFO]                                                                         
[INFO] ------------------------------------------------------------------------
[INFO] Building jspwiki-it-test-custom-absolute-urls 2.10.3-SNAPSHOT
[INFO] ------------------------------------------------------------------------
[INFO] 
[INFO] --- maven-clean-plugin:2.6.1:clean (default-clean) @ jspwiki-it-test-custom-absolute-urls
---
[INFO] 
[INFO] --- maven-enforcer-plugin:1.4:enforce (enforcer-validations) @ jspwiki-it-test-custom-absolute-urls
---
[INFO] 
[INFO] --- maven-remote-resources-plugin:1.5:process (default) @ jspwiki-it-test-custom-absolute-urls
---
[INFO] 
[INFO] --- maven-resources-plugin:2.7:resources (default-resources) @ jspwiki-it-test-custom-absolute-urls
---
[INFO] Using 'UTF-8' encoding to copy filtered resources.
[INFO] skip non existing resourceDirectory <https://builds.apache.org/job/JSPWiki-sonarqube/ws/jspwiki-it-tests/jspwiki-it-test-custom-absolute-urls/src/main/resources>
[INFO] Copying 3 resources
[INFO] 
[INFO] --- maven-compiler-plugin:3.3:compile (default-compile) @ jspwiki-it-test-custom-absolute-urls
---
[INFO] No sources to compile
[INFO] 
[INFO] --- maven-resources-plugin:2.7:testResources (default-testResources) @ jspwiki-it-test-custom-absolute-urls
---
[INFO] Using 'UTF-8' encoding to copy filtered resources.
[INFO] skip non existing resourceDirectory <https://builds.apache.org/job/JSPWiki-sonarqube/ws/jspwiki-it-tests/jspwiki-it-test-custom-absolute-urls/src/test/resources>
[INFO] Copying 3 resources
[INFO] 
[INFO] --- maven-compiler-plugin:3.3:testCompile (default-testCompile) @ jspwiki-it-test-custom-absolute-urls
---
[INFO] No sources to compile
[INFO] 
[INFO] --- maven-surefire-plugin:2.18.1:test (default-test) @ jspwiki-it-test-custom-absolute-urls
---
[INFO] 
[INFO] --- maven-war-plugin:2.6:war (default-war) @ jspwiki-it-test-custom-absolute-urls ---
[INFO] Packaging webapp
[INFO] Assembling webapp [jspwiki-it-test-custom-absolute-urls] in [<https://builds.apache.org/job/JSPWiki-sonarqube/ws/jspwiki-it-tests/jspwiki-it-test-custom-absolute-urls/target/jspwiki-it-test-custom-absolute-urls]>
[INFO] Processing war project
[INFO] Copying webapp resources [<https://builds.apache.org/job/JSPWiki-sonarqube/ws/jspwiki-it-tests/jspwiki-it-test-custom-absolute-urls/src/main/webapp]>
[INFO] Building jar: <https://builds.apache.org/job/JSPWiki-sonarqube/ws/jspwiki-it-tests/jspwiki-it-test-custom-absolute-urls/target/jspwiki-it-test-custom-absolute-urls/WEB-INF/lib/jspwiki-it-test-custom-absolute-urls-2.10.3-SNAPSHOT.jar>
[INFO] Webapp assembled in [24 msecs]
[INFO] Building war: <https://builds.apache.org/job/JSPWiki-sonarqube/ws/jspwiki-it-tests/jspwiki-it-test-custom-absolute-urls/target/jspwiki-it-test-custom-absolute-urls.war>
[INFO] 
[INFO] --- maven-site-plugin:3.4:attach-descriptor (attach-descriptor) @ jspwiki-it-test-custom-absolute-urls
---
[INFO]                                                                         
[INFO] ------------------------------------------------------------------------
[INFO] Building jspwiki-it-test-custom-jdbc 2.10.3-SNAPSHOT
[INFO] ------------------------------------------------------------------------
[INFO] 
[INFO] --- maven-clean-plugin:2.6.1:clean (default-clean) @ jspwiki-it-test-custom-jdbc ---
[INFO] 
[INFO] --- maven-enforcer-plugin:1.4:enforce (enforcer-validations) @ jspwiki-it-test-custom-jdbc
---
[INFO] 
[INFO] --- maven-remote-resources-plugin:1.5:process (default) @ jspwiki-it-test-custom-jdbc
---
[INFO] 
[INFO] --- maven-resources-plugin:2.7:resources (default-resources) @ jspwiki-it-test-custom-jdbc
---
[INFO] Using 'UTF-8' encoding to copy filtered resources.
[INFO] skip non existing resourceDirectory <https://builds.apache.org/job/JSPWiki-sonarqube/ws/jspwiki-it-tests/jspwiki-it-test-custom-jdbc/src/main/resources>
[INFO] Copying 3 resources
[INFO] 
[INFO] --- maven-compiler-plugin:3.3:compile (default-compile) @ jspwiki-it-test-custom-jdbc
---
[INFO] No sources to compile
[INFO] 
[INFO] --- maven-resources-plugin:2.7:testResources (default-testResources) @ jspwiki-it-test-custom-jdbc
---
[INFO] Using 'UTF-8' encoding to copy filtered resources.
[INFO] skip non existing resourceDirectory <https://builds.apache.org/job/JSPWiki-sonarqube/ws/jspwiki-it-tests/jspwiki-it-test-custom-jdbc/src/test/resources>
[INFO] Copying 3 resources
[INFO] 
[INFO] --- maven-compiler-plugin:3.3:testCompile (default-testCompile) @ jspwiki-it-test-custom-jdbc
---
[INFO] No sources to compile
[INFO] 
[INFO] --- maven-surefire-plugin:2.18.1:test (default-test) @ jspwiki-it-test-custom-jdbc
---
[INFO] 
[INFO] --- maven-war-plugin:2.6:war (default-war) @ jspwiki-it-test-custom-jdbc ---
[INFO] Packaging webapp
[INFO] Assembling webapp [jspwiki-it-test-custom-jdbc] in [<https://builds.apache.org/job/JSPWiki-sonarqube/ws/jspwiki-it-tests/jspwiki-it-test-custom-jdbc/target/jspwiki-it-test-custom-jdbc]>
[INFO] Processing war project
[INFO] Copying webapp resources [<https://builds.apache.org/job/JSPWiki-sonarqube/ws/jspwiki-it-tests/jspwiki-it-test-custom-jdbc/src/main/webapp]>
[INFO] Building jar: <https://builds.apache.org/job/JSPWiki-sonarqube/ws/jspwiki-it-tests/jspwiki-it-test-custom-jdbc/target/jspwiki-it-test-custom-jdbc/WEB-INF/lib/jspwiki-it-test-custom-jdbc-2.10.3-SNAPSHOT.jar>
[INFO] Webapp assembled in [40 msecs]
[INFO] Building war: <https://builds.apache.org/job/JSPWiki-sonarqube/ws/jspwiki-it-tests/jspwiki-it-test-custom-jdbc/target/jspwiki-it-test-custom-jdbc.war>
[INFO] 
[INFO] --- maven-site-plugin:3.4:attach-descriptor (attach-descriptor) @ jspwiki-it-test-custom-jdbc
---
[INFO]                                                                         
[INFO] ------------------------------------------------------------------------
[INFO] Building jspwiki-it-test-cma 2.10.3-SNAPSHOT
[INFO] ------------------------------------------------------------------------
[INFO] 
[INFO] --- maven-clean-plugin:2.6.1:clean (default-clean) @ jspwiki-it-test-cma ---
[INFO] 
[INFO] --- maven-enforcer-plugin:1.4:enforce (enforcer-validations) @ jspwiki-it-test-cma
---
[INFO] 
[INFO] --- maven-remote-resources-plugin:1.5:process (default) @ jspwiki-it-test-cma ---
[INFO] 
[INFO] --- maven-resources-plugin:2.7:resources (default-resources) @ jspwiki-it-test-cma
---
[INFO] Using 'UTF-8' encoding to copy filtered resources.
[INFO] skip non existing resourceDirectory <https://builds.apache.org/job/JSPWiki-sonarqube/ws/jspwiki-it-tests/jspwiki-it-test-cma/src/main/resources>
[INFO] Copying 3 resources
[INFO] 
[INFO] --- maven-compiler-plugin:3.3:compile (default-compile) @ jspwiki-it-test-cma ---
[INFO] No sources to compile
[INFO] 
[INFO] --- maven-resources-plugin:2.7:testResources (default-testResources) @ jspwiki-it-test-cma
---
[INFO] Using 'UTF-8' encoding to copy filtered resources.
[INFO] skip non existing resourceDirectory <https://builds.apache.org/job/JSPWiki-sonarqube/ws/jspwiki-it-tests/jspwiki-it-test-cma/src/test/resources>
[INFO] Copying 3 resources
[INFO] 
[INFO] --- maven-compiler-plugin:3.3:testCompile (default-testCompile) @ jspwiki-it-test-cma
---
[INFO] No sources to compile
[INFO] 
[INFO] --- maven-surefire-plugin:2.18.1:test (default-test) @ jspwiki-it-test-cma ---
[INFO] 
[INFO] --- maven-war-plugin:2.6:war (default-war) @ jspwiki-it-test-cma ---
[INFO] Packaging webapp
[INFO] Assembling webapp [jspwiki-it-test-cma] in [<https://builds.apache.org/job/JSPWiki-sonarqube/ws/jspwiki-it-tests/jspwiki-it-test-cma/target/jspwiki-it-test-cma]>
[INFO] Processing war project
[INFO] Copying webapp resources [<https://builds.apache.org/job/JSPWiki-sonarqube/ws/jspwiki-it-tests/jspwiki-it-test-cma/src/main/webapp]>
[INFO] Building jar: <https://builds.apache.org/job/JSPWiki-sonarqube/ws/jspwiki-it-tests/jspwiki-it-test-cma/target/jspwiki-it-test-cma/WEB-INF/lib/jspwiki-it-test-cma-2.10.3-SNAPSHOT.jar>
[INFO] Webapp assembled in [77 msecs]
[INFO] Building war: <https://builds.apache.org/job/JSPWiki-sonarqube/ws/jspwiki-it-tests/jspwiki-it-test-cma/target/jspwiki-it-test-cma.war>
[INFO] 
[INFO] --- maven-site-plugin:3.4:attach-descriptor (attach-descriptor) @ jspwiki-it-test-cma
---
[INFO]                                                                         
[INFO] ------------------------------------------------------------------------
[INFO] Building jspwiki-it-test-cma-jdbc 2.10.3-SNAPSHOT
[INFO] ------------------------------------------------------------------------
[INFO] 
[INFO] --- maven-clean-plugin:2.6.1:clean (default-clean) @ jspwiki-it-test-cma-jdbc ---
[INFO] 
[INFO] --- maven-enforcer-plugin:1.4:enforce (enforcer-validations) @ jspwiki-it-test-cma-jdbc
---
[INFO] 
[INFO] --- maven-remote-resources-plugin:1.5:process (default) @ jspwiki-it-test-cma-jdbc
---
[INFO] 
[INFO] --- maven-resources-plugin:2.7:resources (default-resources) @ jspwiki-it-test-cma-jdbc
---
[INFO] Using 'UTF-8' encoding to copy filtered resources.
[INFO] Copying 1 resource
[INFO] Copying 3 resources
[INFO] 
[INFO] --- maven-compiler-plugin:3.3:compile (default-compile) @ jspwiki-it-test-cma-jdbc
---
[INFO] No sources to compile
[INFO] 
[INFO] --- maven-resources-plugin:2.7:testResources (default-testResources) @ jspwiki-it-test-cma-jdbc
---
[INFO] Using 'UTF-8' encoding to copy filtered resources.
[INFO] skip non existing resourceDirectory <https://builds.apache.org/job/JSPWiki-sonarqube/ws/jspwiki-it-tests/jspwiki-it-test-cma-jdbc/src/test/resources>
[INFO] Copying 3 resources
[INFO] 
[INFO] --- maven-compiler-plugin:3.3:testCompile (default-testCompile) @ jspwiki-it-test-cma-jdbc
---
[INFO] No sources to compile
[INFO] 
[INFO] --- maven-surefire-plugin:2.18.1:test (default-test) @ jspwiki-it-test-cma-jdbc ---
[INFO] 
[INFO] --- maven-war-plugin:2.6:war (default-war) @ jspwiki-it-test-cma-jdbc ---
[INFO] Packaging webapp
[INFO] Assembling webapp [jspwiki-it-test-cma-jdbc] in [<https://builds.apache.org/job/JSPWiki-sonarqube/ws/jspwiki-it-tests/jspwiki-it-test-cma-jdbc/target/jspwiki-it-test-cma-jdbc]>
[INFO] Processing war project
[INFO] Copying webapp resources [<https://builds.apache.org/job/JSPWiki-sonarqube/ws/jspwiki-it-tests/jspwiki-it-test-cma-jdbc/src/main/webapp]>
[INFO] Building jar: <https://builds.apache.org/job/JSPWiki-sonarqube/ws/jspwiki-it-tests/jspwiki-it-test-cma-jdbc/target/jspwiki-it-test-cma-jdbc/WEB-INF/lib/jspwiki-it-test-cma-jdbc-2.10.3-SNAPSHOT.jar>
[INFO] Webapp assembled in [22 msecs]
[INFO] Building war: <https://builds.apache.org/job/JSPWiki-sonarqube/ws/jspwiki-it-tests/jspwiki-it-test-cma-jdbc/target/jspwiki-it-test-cma-jdbc.war>
[INFO] 
[INFO] --- maven-site-plugin:3.4:attach-descriptor (attach-descriptor) @ jspwiki-it-test-cma-jdbc
---
[INFO]                                                                         
[INFO] ------------------------------------------------------------------------
[INFO] Building Apache JSPWiki 2.10.3-SNAPSHOT
[INFO] ------------------------------------------------------------------------
[INFO] 
[INFO] --- sonar-maven-plugin:2.6:sonar (default-cli) @ jspwiki-builder ---
Downloading: http://repo.maven.apache.org/maven2/org/codehaus/sonar/runner/sonar-runner-api/2.4/sonar-runner-api-2.4.pom
4/6 KB                  6/6 KB            Downloaded: http://repo.maven.apache.org/maven2/org/codehaus/sonar/runner/sonar-runner-api/2.4/sonar-runner-api-2.4.pom
(6 KB at 55.8 KB/sec)
Downloading: http://repo.maven.apache.org/maven2/org/codehaus/sonar/runner/sonar-runner/2.4/sonar-runner-2.4.pom
4/5 KB   5/5 KB            Downloaded: http://repo.maven.apache.org/maven2/org/codehaus/sonar/runner/sonar-runner/2.4/sonar-runner-2.4.pom
(5 KB at 289.2 KB/sec)
Downloading: http://repo.maven.apache.org/maven2/org/codehaus/sonar-plugins/parent/17/parent-17.pom
4/21 KB   6/21 KB   10/21 KB   11/21 KB   15/21 KB   17/21 KB   21/21 KB   21/21 KB      
       Downloaded: http://repo.maven.apache.org/maven2/org/codehaus/sonar-plugins/parent/17/parent-17.pom
(21 KB at 1083.5 KB/sec)
Downloading: http://repo.maven.apache.org/maven2/org/codehaus/sonar/runner/sonar-runner-api/2.4/sonar-runner-api-2.4.jar
4/260 KB   8/260 KB   8/260 KB   12/260 KB   13/260 KB   17/260 KB   17/260 KB   21/260 KB
  21/260 KB   25/260 KB   25/260 KB   29/260 KB   30/260 KB   34/260 KB   34/260 KB   38/260
KB   38/260 KB   42/260 KB   42/260 KB   46/260 KB   47/260 KB   51/260 KB   52/260 KB   56/260
KB   58/260 KB   62/260 KB   64/260 KB   68/260 KB   69/260 KB   73/260 KB   75/260 KB   79/260
KB   80/260 KB   84/260 KB   88/260 KB   92/260 KB   95/260 KB   99/260 KB   102/260 KB  
105/260 KB   109/260 KB   112/260 KB   116/260 KB   119/260 KB   123/260 KB   127/260 KB 
 127/260 KB   131/260 KB   135/260 KB   139/260 KB   143/260 KB   147/260 KB   151/260 KB
  155/260 KB   159/260 KB   163/260 KB   167/260 KB   171/260 KB   175/260 KB   179/260 KB
  183/260 KB   185/260 KB   189/260 KB   193/260 KB   197/260 KB   201/260 KB   205/260 KB
  209/260 KB   213/260 KB   217/260 KB   220/260 KB   224/260 KB   228/260 KB   232/260 KB
  236/260 KB   240/260 KB   244/260 KB   248/260 KB   252/260 KB   256/260 KB   260/260 KB
               Downloaded: http://repo.maven.apache.org/maven2/org/codehaus/sonar/runner/sonar-runner-api/2.4/sonar-runner-api-2.4.jar
(260 KB at 5197.9 KB/sec)
[INFO] SonarQube version: 5.6.3
INFO: Default locale: "en_US", source code encoding: "UTF-8"
INFO: Work directory: <https://builds.apache.org/job/JSPWiki-sonarqube/ws/target/sonar>
INFO: SonarQube Server 5.6.3
[INFO] ------------------------------------------------------------------------
[INFO] Reactor Summary:
[INFO] 
[INFO] Apache JSPWiki .................................... FAILURE [1.299s]
[INFO] Apache JSPWiki initial wiki pages builder ......... SUCCESS [0.024s]
[INFO] Apache JSPWiki initial wiki pages (de) ............ SUCCESS [1.307s]
[INFO] Apache JSPWiki initial wiki pages (en) ............ SUCCESS [0.174s]
[INFO] Apache JSPWiki initial wiki pages (es) ............ SUCCESS [0.209s]
[INFO] Apache JSPWiki initial wiki pages (fi) ............ SUCCESS [0.167s]
[INFO] Apache JSPWiki initial wiki pages (fr) ............ SUCCESS [0.177s]
[INFO] Apache JSPWiki initial wiki pages (it) ............ SUCCESS [0.207s]
[INFO] Apache JSPWiki initial wiki pages (nl) ............ SUCCESS [0.161s]
[INFO] Apache JSPWiki initial wiki pages (pt_BR) ......... SUCCESS [0.217s]
[INFO] Apache JSPWiki initial wiki pages (ru) ............ SUCCESS [0.185s]
[INFO] Apache JSPWiki initial wiki pages (zh_CN) ......... SUCCESS [0.223s]
[INFO] Apache JSPWiki Main War ........................... SUCCESS [2:54.994s]
[INFO] Apache JSPWiki portable ........................... SUCCESS [7.304s]
[INFO] jspwiki-it-builder ................................ SUCCESS [0.026s]
[INFO] jspwiki-selenium-tests ............................ SUCCESS [1.877s]
[INFO] jspwiki-it-test-custom ............................ SUCCESS [0.090s]
[INFO] jspwiki-it-test-custom-absolute-urls .............. SUCCESS [0.083s]
[INFO] jspwiki-it-test-custom-jdbc ....................... SUCCESS [0.140s]
[INFO] jspwiki-it-test-cma ............................... SUCCESS [0.143s]
[INFO] jspwiki-it-test-cma-jdbc .......................... SUCCESS [0.084s]
[INFO] ------------------------------------------------------------------------
[INFO] BUILD FAILURE
[INFO] ------------------------------------------------------------------------
[INFO] Total time: 3:12.568s
[INFO] Finished at: Fri Mar 03 19:57:31 UTC 2017
[INFO] Final Memory: 146M/5377M
[INFO] ------------------------------------------------------------------------
[ERROR] Failed to execute goal org.codehaus.mojo:sonar-maven-plugin:2.6:sonar (default-cli)
on project jspwiki-builder: Execution default-cli of goal org.codehaus.mojo:sonar-maven-plugin:2.6:sonar
failed: An API incompatibility was encountered while executing org.codehaus.mojo:sonar-maven-plugin:2.6:sonar:
java.lang.UnsupportedClassVersionError: org/sonar/api/utils/SonarException : Unsupported major.minor
version 52.0
[ERROR] -----------------------------------------------------
[ERROR] realm =    plugin>org.codehaus.mojo:sonar-maven-plugin:2.6
[ERROR] strategy = org.codehaus.plexus.classworlds.strategy.SelfFirstStrategy
[ERROR] urls[0] = file:/home/jenkins/.m2/repository/org/codehaus/mojo/sonar-maven-plugin/2.6/sonar-maven-plugin-2.6.jar
[ERROR] urls[1] = file:/home/jenkins/.m2/repository/org/apache/maven/shared/maven-dependency-tree/2.1/maven-dependency-tree-2.1.jar
[ERROR] urls[2] = file:/home/jenkins/.m2/repository/backport-util-concurrent/backport-util-concurrent/3.1/backport-util-concurrent-3.1.jar
[ERROR] urls[3] = file:/home/jenkins/.m2/repository/org/codehaus/plexus/plexus-interpolation/1.11/plexus-interpolation-1.11.jar
[ERROR] urls[4] = file:/home/jenkins/.m2/repository/org/codehaus/plexus/plexus-component-annotations/1.5.5/plexus-component-annotations-1.5.5.jar
[ERROR] urls[5] = file:/home/jenkins/.m2/repository/org/eclipse/aether/aether-util/0.9.0.M2/aether-util-0.9.0.M2.jar
[ERROR] urls[6] = file:/home/jenkins/.m2/repository/org/sonatype/plexus/plexus-sec-dispatcher/1.4/plexus-sec-dispatcher-1.4.jar
[ERROR] urls[7] = file:/home/jenkins/.m2/repository/org/codehaus/plexus/plexus-utils/1.5.5/plexus-utils-1.5.5.jar
[ERROR] urls[8] = file:/home/jenkins/.m2/repository/org/sonatype/plexus/plexus-cipher/1.4/plexus-cipher-1.4.jar
[ERROR] urls[9] = file:/home/jenkins/.m2/repository/org/codehaus/sonar/runner/sonar-runner-api/2.4/sonar-runner-api-2.4.jar
[ERROR] urls[10] = file:/home/jenkins/.m2/repository/commons-lang/commons-lang/2.6/commons-lang-2.6.jar
[ERROR] urls[11] = file:/home/jenkins/.m2/repository/com/google/guava/guava/10.0.1/guava-10.0.1.jar
[ERROR] urls[12] = file:/home/jenkins/.m2/repository/com/google/code/findbugs/jsr305/2.0.3/jsr305-2.0.3.jar
[ERROR] Number of foreign imports: 1
[ERROR] import: Entry[import  from realm ClassRealm[maven.api, parent: null]]
[ERROR] 
[ERROR] -----------------------------------------------------
[ERROR] -> [Help 1]
[ERROR] 
[ERROR] To see the full stack trace of the errors, re-run Maven with the -e switch.
[ERROR] Re-run Maven using the -X switch to enable full debug logging.
[ERROR] 
[ERROR] For more information about the errors and possible solutions, please read the following
articles:
[ERROR] [Help 1] http://cwiki.apache.org/confluence/display/MAVEN/PluginContainerException
Build step 'Invoke top-level Maven targets' marked build as failure

Mime
View raw message