jspwiki-commits mailing list archives

Site index · List index
Message view « Date » · « Thread »
Top « Date » · « Thread »
From Apache Jenkins Server <jenk...@builds.apache.org>
Subject Build failed in Jenkins: JSPWiki-sonarqube #1
Date Sun, 05 Feb 2017 16:58:33 GMT
See <https://builds.apache.org/job/JSPWiki-sonarqube/1/>

------------------------------------------
[...truncated 1571 lines...]
[INFO] --- maven-surefire-plugin:2.18.1:test (default-test) @ jspwiki-it-test-custom-jdbc
---
[INFO] 
[INFO] --- maven-war-plugin:2.6:war (default-war) @ jspwiki-it-test-custom-jdbc ---
[INFO] Packaging webapp
[INFO] Assembling webapp [jspwiki-it-test-custom-jdbc] in [<https://builds.apache.org/job/JSPWiki-sonarqube/ws/jspwiki-it-tests/jspwiki-it-test-custom-jdbc/target/jspwiki-it-test-custom-jdbc]>
[INFO] Processing war project
[INFO] Copying webapp resources [<https://builds.apache.org/job/JSPWiki-sonarqube/ws/jspwiki-it-tests/jspwiki-it-test-custom-jdbc/src/main/webapp]>
[INFO] Building jar: <https://builds.apache.org/job/JSPWiki-sonarqube/ws/jspwiki-it-tests/jspwiki-it-test-custom-jdbc/target/jspwiki-it-test-custom-jdbc/WEB-INF/lib/jspwiki-it-test-custom-jdbc-2.10.3-SNAPSHOT.jar>
[INFO] Webapp assembled in [57 msecs]
[INFO] Building war: <https://builds.apache.org/job/JSPWiki-sonarqube/ws/jspwiki-it-tests/jspwiki-it-test-custom-jdbc/target/jspwiki-it-test-custom-jdbc.war>
[INFO] 
[INFO] --- maven-site-plugin:3.4:attach-descriptor (attach-descriptor) @ jspwiki-it-test-custom-jdbc
---
[INFO]                                                                         
[INFO] ------------------------------------------------------------------------
[INFO] Building jspwiki-it-test-cma 2.10.3-SNAPSHOT
[INFO] ------------------------------------------------------------------------
[INFO] 
[INFO] --- maven-clean-plugin:2.6.1:clean (default-clean) @ jspwiki-it-test-cma ---
[INFO] 
[INFO] --- maven-enforcer-plugin:1.4:enforce (enforcer-validations) @ jspwiki-it-test-cma
---
[INFO] 
[INFO] --- maven-remote-resources-plugin:1.5:process (default) @ jspwiki-it-test-cma ---
[INFO] 
[INFO] --- maven-resources-plugin:2.7:resources (default-resources) @ jspwiki-it-test-cma
---
[INFO] Using 'UTF-8' encoding to copy filtered resources.
[INFO] skip non existing resourceDirectory <https://builds.apache.org/job/JSPWiki-sonarqube/ws/jspwiki-it-tests/jspwiki-it-test-cma/src/main/resources>
[INFO] Copying 3 resources
[INFO] 
[INFO] --- maven-compiler-plugin:3.3:compile (default-compile) @ jspwiki-it-test-cma ---
[INFO] No sources to compile
[INFO] 
[INFO] --- maven-resources-plugin:2.7:testResources (default-testResources) @ jspwiki-it-test-cma
---
[INFO] Using 'UTF-8' encoding to copy filtered resources.
[INFO] skip non existing resourceDirectory <https://builds.apache.org/job/JSPWiki-sonarqube/ws/jspwiki-it-tests/jspwiki-it-test-cma/src/test/resources>
[INFO] Copying 3 resources
[INFO] 
[INFO] --- maven-compiler-plugin:3.3:testCompile (default-testCompile) @ jspwiki-it-test-cma
---
[INFO] No sources to compile
[INFO] 
[INFO] --- maven-surefire-plugin:2.18.1:test (default-test) @ jspwiki-it-test-cma ---
[INFO] 
[INFO] --- maven-war-plugin:2.6:war (default-war) @ jspwiki-it-test-cma ---
[INFO] Packaging webapp
[INFO] Assembling webapp [jspwiki-it-test-cma] in [<https://builds.apache.org/job/JSPWiki-sonarqube/ws/jspwiki-it-tests/jspwiki-it-test-cma/target/jspwiki-it-test-cma]>
[INFO] Processing war project
[INFO] Copying webapp resources [<https://builds.apache.org/job/JSPWiki-sonarqube/ws/jspwiki-it-tests/jspwiki-it-test-cma/src/main/webapp]>
[INFO] Building jar: <https://builds.apache.org/job/JSPWiki-sonarqube/ws/jspwiki-it-tests/jspwiki-it-test-cma/target/jspwiki-it-test-cma/WEB-INF/lib/jspwiki-it-test-cma-2.10.3-SNAPSHOT.jar>
[INFO] Webapp assembled in [68 msecs]
[INFO] Building war: <https://builds.apache.org/job/JSPWiki-sonarqube/ws/jspwiki-it-tests/jspwiki-it-test-cma/target/jspwiki-it-test-cma.war>
[INFO] 
[INFO] --- maven-site-plugin:3.4:attach-descriptor (attach-descriptor) @ jspwiki-it-test-cma
---
[INFO]                                                                         
[INFO] ------------------------------------------------------------------------
[INFO] Building jspwiki-it-test-cma-jdbc 2.10.3-SNAPSHOT
[INFO] ------------------------------------------------------------------------
[INFO] 
[INFO] --- maven-clean-plugin:2.6.1:clean (default-clean) @ jspwiki-it-test-cma-jdbc ---
[INFO] 
[INFO] --- maven-enforcer-plugin:1.4:enforce (enforcer-validations) @ jspwiki-it-test-cma-jdbc
---
[INFO] 
[INFO] --- maven-remote-resources-plugin:1.5:process (default) @ jspwiki-it-test-cma-jdbc
---
[INFO] 
[INFO] --- maven-resources-plugin:2.7:resources (default-resources) @ jspwiki-it-test-cma-jdbc
---
[INFO] Using 'UTF-8' encoding to copy filtered resources.
[INFO] Copying 1 resource
[INFO] Copying 3 resources
[INFO] 
[INFO] --- maven-compiler-plugin:3.3:compile (default-compile) @ jspwiki-it-test-cma-jdbc
---
[INFO] No sources to compile
[INFO] 
[INFO] --- maven-resources-plugin:2.7:testResources (default-testResources) @ jspwiki-it-test-cma-jdbc
---
[INFO] Using 'UTF-8' encoding to copy filtered resources.
[INFO] skip non existing resourceDirectory <https://builds.apache.org/job/JSPWiki-sonarqube/ws/jspwiki-it-tests/jspwiki-it-test-cma-jdbc/src/test/resources>
[INFO] Copying 3 resources
[INFO] 
[INFO] --- maven-compiler-plugin:3.3:testCompile (default-testCompile) @ jspwiki-it-test-cma-jdbc
---
[INFO] No sources to compile
[INFO] 
[INFO] --- maven-surefire-plugin:2.18.1:test (default-test) @ jspwiki-it-test-cma-jdbc ---
[INFO] 
[INFO] --- maven-war-plugin:2.6:war (default-war) @ jspwiki-it-test-cma-jdbc ---
[INFO] Packaging webapp
[INFO] Assembling webapp [jspwiki-it-test-cma-jdbc] in [<https://builds.apache.org/job/JSPWiki-sonarqube/ws/jspwiki-it-tests/jspwiki-it-test-cma-jdbc/target/jspwiki-it-test-cma-jdbc]>
[INFO] Processing war project
[INFO] Copying webapp resources [<https://builds.apache.org/job/JSPWiki-sonarqube/ws/jspwiki-it-tests/jspwiki-it-test-cma-jdbc/src/main/webapp]>
[INFO] Building jar: <https://builds.apache.org/job/JSPWiki-sonarqube/ws/jspwiki-it-tests/jspwiki-it-test-cma-jdbc/target/jspwiki-it-test-cma-jdbc/WEB-INF/lib/jspwiki-it-test-cma-jdbc-2.10.3-SNAPSHOT.jar>
[INFO] Webapp assembled in [51 msecs]
[INFO] Building war: <https://builds.apache.org/job/JSPWiki-sonarqube/ws/jspwiki-it-tests/jspwiki-it-test-cma-jdbc/target/jspwiki-it-test-cma-jdbc.war>
[INFO] 
[INFO] --- maven-site-plugin:3.4:attach-descriptor (attach-descriptor) @ jspwiki-it-test-cma-jdbc
---
[INFO]                                                                         
[INFO] ------------------------------------------------------------------------
[INFO] Building Apache JSPWiki 2.10.3-SNAPSHOT
[INFO] ------------------------------------------------------------------------
[INFO] 
[INFO] --- sonar-maven-plugin:2.6:sonar (default-cli) @ jspwiki-builder ---
Downloading: http://repo.maven.apache.org/maven2/org/codehaus/sonar/runner/sonar-runner-api/2.4/sonar-runner-api-2.4.pom
4/6 KB                  
5/6 KB   
6/6 KB   
         
Downloaded: http://repo.maven.apache.org/maven2/org/codehaus/sonar/runner/sonar-runner-api/2.4/sonar-runner-api-2.4.pom
(6 KB at 264.1 KB/sec)
Downloading: http://repo.maven.apache.org/maven2/org/codehaus/sonar/runner/sonar-runner/2.4/sonar-runner-2.4.pom
4/5 KB   
5/5 KB   
         
Downloaded: http://repo.maven.apache.org/maven2/org/codehaus/sonar/runner/sonar-runner/2.4/sonar-runner-2.4.pom
(5 KB at 220.3 KB/sec)
Downloading: http://repo.maven.apache.org/maven2/org/codehaus/sonar-plugins/parent/17/parent-17.pom
4/21 KB   
8/21 KB   
12/21 KB   
16/21 KB   
20/21 KB   
21/21 KB   
           
Downloaded: http://repo.maven.apache.org/maven2/org/codehaus/sonar-plugins/parent/17/parent-17.pom
(21 KB at 980.3 KB/sec)
Downloading: http://repo.maven.apache.org/maven2/org/codehaus/sonar/runner/sonar-runner-api/2.4/sonar-runner-api-2.4.jar
4/260 KB   
8/260 KB   
12/260 KB   
16/260 KB   
20/260 KB   
24/260 KB   
28/260 KB   
32/260 KB   
36/260 KB   
40/260 KB   
44/260 KB   
48/260 KB   
52/260 KB   
56/260 KB   
60/260 KB   
64/260 KB   
68/260 KB   
72/260 KB   
76/260 KB   
80/260 KB   
84/260 KB   
88/260 KB   
92/260 KB   
96/260 KB   
100/260 KB   
104/260 KB   
108/260 KB   
112/260 KB   
116/260 KB   
120/260 KB   
124/260 KB   
128/260 KB   
132/260 KB   
136/260 KB   
140/260 KB   
144/260 KB   
148/260 KB   
152/260 KB   
156/260 KB   
160/260 KB   
164/260 KB   
168/260 KB   
172/260 KB   
176/260 KB   
180/260 KB   
184/260 KB   
188/260 KB   
192/260 KB   
196/260 KB   
200/260 KB   
204/260 KB   
208/260 KB   
212/260 KB   
216/260 KB   
220/260 KB   
224/260 KB   
228/260 KB   
232/260 KB   
236/260 KB   
240/260 KB   
244/260 KB   
248/260 KB   
252/260 KB   
256/260 KB   
260/260 KB   
260/260 KB   
             
Downloaded: http://repo.maven.apache.org/maven2/org/codehaus/sonar/runner/sonar-runner-api/2.4/sonar-runner-api-2.4.jar
(260 KB at 2679.4 KB/sec)
[INFO] SonarQube version: 5.6.3
INFO: Default locale: "en_US", source code encoding: "UTF-8"
INFO: Work directory: <https://builds.apache.org/job/JSPWiki-sonarqube/ws/target/sonar>
INFO: SonarQube Server 5.6.3
[INFO] ------------------------------------------------------------------------
[INFO] Reactor Summary:
[INFO] 
[INFO] Apache JSPWiki .................................... FAILURE [2.184s]
[INFO] Apache JSPWiki initial wiki pages builder ......... SUCCESS [0.023s]
[INFO] Apache JSPWiki initial wiki pages (de) ............ SUCCESS [2.015s]
[INFO] Apache JSPWiki initial wiki pages (en) ............ SUCCESS [0.257s]
[INFO] Apache JSPWiki initial wiki pages (es) ............ SUCCESS [0.239s]
[INFO] Apache JSPWiki initial wiki pages (fi) ............ SUCCESS [0.165s]
[INFO] Apache JSPWiki initial wiki pages (fr) ............ SUCCESS [0.218s]
[INFO] Apache JSPWiki initial wiki pages (it) ............ SUCCESS [0.201s]
[INFO] Apache JSPWiki initial wiki pages (nl) ............ SUCCESS [0.194s]
[INFO] Apache JSPWiki initial wiki pages (pt_BR) ......... SUCCESS [0.286s]
[INFO] Apache JSPWiki initial wiki pages (ru) ............ SUCCESS [0.366s]
[INFO] Apache JSPWiki initial wiki pages (zh_CN) ......... SUCCESS [0.349s]
[INFO] Apache JSPWiki Main War ........................... SUCCESS [3:17.070s]
[INFO] Apache JSPWiki portable ........................... SUCCESS [10.185s]
[INFO] jspwiki-it-builder ................................ SUCCESS [0.023s]
[INFO] jspwiki-selenium-tests ............................ SUCCESS [2.403s]
[INFO] jspwiki-it-test-custom ............................ SUCCESS [0.183s]
[INFO] jspwiki-it-test-custom-absolute-urls .............. SUCCESS [0.295s]
[INFO] jspwiki-it-test-custom-jdbc ....................... SUCCESS [0.224s]
[INFO] jspwiki-it-test-cma ............................... SUCCESS [0.204s]
[INFO] jspwiki-it-test-cma-jdbc .......................... SUCCESS [0.228s]
[INFO] ------------------------------------------------------------------------
[INFO] BUILD FAILURE
[INFO] ------------------------------------------------------------------------
[INFO] Total time: 3:44.933s
[INFO] Finished at: Sun Feb 05 16:58:31 UTC 2017
[INFO] Final Memory: 89M/1294M
[INFO] ------------------------------------------------------------------------
[ERROR] Failed to execute goal org.codehaus.mojo:sonar-maven-plugin:2.6:sonar (default-cli)
on project jspwiki-builder: Execution default-cli of goal org.codehaus.mojo:sonar-maven-plugin:2.6:sonar
failed: An API incompatibility was encountered while executing org.codehaus.mojo:sonar-maven-plugin:2.6:sonar:
java.lang.UnsupportedClassVersionError: org/sonar/api/utils/SonarException : Unsupported major.minor
version 52.0
[ERROR] -----------------------------------------------------
[ERROR] realm =    plugin>org.codehaus.mojo:sonar-maven-plugin:2.6
[ERROR] strategy = org.codehaus.plexus.classworlds.strategy.SelfFirstStrategy
[ERROR] urls[0] = file:/home/jenkins/.m2/repository/org/codehaus/mojo/sonar-maven-plugin/2.6/sonar-maven-plugin-2.6.jar
[ERROR] urls[1] = file:/home/jenkins/.m2/repository/org/apache/maven/shared/maven-dependency-tree/2.1/maven-dependency-tree-2.1.jar
[ERROR] urls[2] = file:/home/jenkins/.m2/repository/backport-util-concurrent/backport-util-concurrent/3.1/backport-util-concurrent-3.1.jar
[ERROR] urls[3] = file:/home/jenkins/.m2/repository/org/codehaus/plexus/plexus-interpolation/1.11/plexus-interpolation-1.11.jar
[ERROR] urls[4] = file:/home/jenkins/.m2/repository/org/codehaus/plexus/plexus-component-annotations/1.5.5/plexus-component-annotations-1.5.5.jar
[ERROR] urls[5] = file:/home/jenkins/.m2/repository/org/eclipse/aether/aether-util/0.9.0.M2/aether-util-0.9.0.M2.jar
[ERROR] urls[6] = file:/home/jenkins/.m2/repository/org/sonatype/plexus/plexus-sec-dispatcher/1.4/plexus-sec-dispatcher-1.4.jar
[ERROR] urls[7] = file:/home/jenkins/.m2/repository/org/codehaus/plexus/plexus-utils/1.5.5/plexus-utils-1.5.5.jar
[ERROR] urls[8] = file:/home/jenkins/.m2/repository/org/sonatype/plexus/plexus-cipher/1.4/plexus-cipher-1.4.jar
[ERROR] urls[9] = file:/home/jenkins/.m2/repository/org/codehaus/sonar/runner/sonar-runner-api/2.4/sonar-runner-api-2.4.jar
[ERROR] urls[10] = file:/home/jenkins/.m2/repository/commons-lang/commons-lang/2.6/commons-lang-2.6.jar
[ERROR] urls[11] = file:/home/jenkins/.m2/repository/com/google/guava/guava/10.0.1/guava-10.0.1.jar
[ERROR] urls[12] = file:/home/jenkins/.m2/repository/com/google/code/findbugs/jsr305/2.0.3/jsr305-2.0.3.jar
[ERROR] Number of foreign imports: 1
[ERROR] import: Entry[import  from realm ClassRealm[maven.api, parent: null]]
[ERROR] 
[ERROR] -----------------------------------------------------
[ERROR] -> [Help 1]
[ERROR] 
[ERROR] To see the full stack trace of the errors, re-run Maven with the -e switch.
[ERROR] Re-run Maven using the -X switch to enable full debug logging.
[ERROR] 
[ERROR] For more information about the errors and possible solutions, please read the following
articles:
[ERROR] [Help 1] http://cwiki.apache.org/confluence/display/MAVEN/PluginContainerException
Build step 'Invoke top-level Maven targets' marked build as failure

Mime
View raw message