jspwiki-commits mailing list archives

Site index · List index
Message view « Date » · « Thread »
Top « Date » · « Thread »
From Apache Jenkins Server <jenk...@builds.apache.org>
Subject Build failed in Jenkins: JSPWiki #441
Date Tue, 17 Jan 2017 19:15:31 GMT
See <https://builds.apache.org/job/JSPWiki/441/>

------------------------------------------
[...truncated 1945 lines...]
217/294 KB   
221/294 KB   
225/294 KB   
229/294 KB   
233/294 KB   
237/294 KB   
241/294 KB   
245/294 KB   
249/294 KB   
253/294 KB   
257/294 KB   
261/294 KB   
265/294 KB   
269/294 KB   
273/294 KB   
277/294 KB   
281/294 KB   
285/294 KB   
289/294 KB   
293/294 KB   
294/294 KB   
             
Downloaded: http://repo.maven.apache.org/maven2/org/apache/maven/plugins/maven-project-info-reports-plugin/2.8/maven-project-info-reports-plugin-2.8.jar
(294 KB at 3964.3 KB/sec)
Downloading: http://repo.maven.apache.org/maven2/org/apache/maven/plugins/maven-release-plugin/2.5.1/maven-release-plugin-2.5.1.pom
4/11 KB      
8/11 KB   
11/11 KB   
           
Downloaded: http://repo.maven.apache.org/maven2/org/apache/maven/plugins/maven-release-plugin/2.5.1/maven-release-plugin-2.5.1.pom
(11 KB at 535.9 KB/sec)
Downloading: http://repo.maven.apache.org/maven2/org/apache/maven/release/maven-release/2.5.1/maven-release-2.5.1.pom
4/5 KB     
5/5 KB   
         
Downloaded: http://repo.maven.apache.org/maven2/org/apache/maven/release/maven-release/2.5.1/maven-release-2.5.1.pom
(5 KB at 221.9 KB/sec)
Downloading: http://repo.maven.apache.org/maven2/org/apache/maven/plugins/maven-release-plugin/2.5.1/maven-release-plugin-2.5.1.jar
4/50 KB   
8/50 KB   
12/50 KB   
16/50 KB   
20/50 KB   
24/50 KB   
28/50 KB   
32/50 KB   
34/50 KB   
38/50 KB   
42/50 KB   
45/50 KB   
49/50 KB   
50/50 KB   
           
Downloaded: http://repo.maven.apache.org/maven2/org/apache/maven/plugins/maven-release-plugin/2.5.1/maven-release-plugin-2.5.1.jar
(50 KB at 2070.8 KB/sec)
Downloading: http://repo.maven.apache.org/maven2/org/apache/maven/plugins/maven-scm-plugin/1.9.2/maven-scm-plugin-1.9.2.pom
4/7 KB     
7/7 KB   
         
Downloaded: http://repo.maven.apache.org/maven2/org/apache/maven/plugins/maven-scm-plugin/1.9.2/maven-scm-plugin-1.9.2.pom
(7 KB at 372.9 KB/sec)
Downloading: http://repo.maven.apache.org/maven2/org/apache/maven/plugins/maven-scm-plugin/1.9.2/maven-scm-plugin-1.9.2.jar
4/61 KB   
8/61 KB   
12/61 KB   
16/61 KB   
20/61 KB   
24/61 KB   
25/61 KB   
29/61 KB   
33/61 KB   
34/61 KB   
38/61 KB   
42/61 KB   
42/61 KB   
46/61 KB   
50/61 KB   
51/61 KB   
55/61 KB   
59/61 KB   
59/61 KB   
61/61 KB   
           
Downloaded: http://repo.maven.apache.org/maven2/org/apache/maven/plugins/maven-scm-plugin/1.9.2/maven-scm-plugin-1.9.2.jar
(61 KB at 2341.4 KB/sec)
Downloading: http://repo.maven.apache.org/maven2/org/apache/maven/plugins/maven-scm-publish-plugin/1.1/maven-scm-publish-plugin-1.1.jar
4/37 KB    
7/37 KB   
11/37 KB   
14/37 KB   
18/37 KB   
21/37 KB   
25/37 KB   
28/37 KB   
32/37 KB   
35/37 KB   
37/37 KB   
           
Downloaded: http://repo.maven.apache.org/maven2/org/apache/maven/plugins/maven-scm-publish-plugin/1.1/maven-scm-publish-plugin-1.1.jar
(37 KB at 1676.4 KB/sec)
Downloading: http://repo.maven.apache.org/maven2/org/apache/maven/plugins/maven-source-plugin/2.4/maven-source-plugin-2.4.pom
4/7 KB     
5/7 KB   
7/7 KB   
         
Downloaded: http://repo.maven.apache.org/maven2/org/apache/maven/plugins/maven-source-plugin/2.4/maven-source-plugin-2.4.pom
(7 KB at 360.5 KB/sec)
Downloading: http://repo.maven.apache.org/maven2/org/apache/maven/plugins/maven-source-plugin/2.4/maven-source-plugin-2.4.jar
4/31 KB   
7/31 KB   
11/31 KB   
15/31 KB   
19/31 KB   
21/31 KB   
25/31 KB   
28/31 KB   
31/31 KB   
           
Downloaded: http://repo.maven.apache.org/maven2/org/apache/maven/plugins/maven-source-plugin/2.4/maven-source-plugin-2.4.jar
(31 KB at 1461.4 KB/sec)
Downloading: http://repo.maven.apache.org/maven2/org/apache/maven/plugins/maven-surefire-report-plugin/2.18.1/maven-surefire-report-plugin-2.18.1.pom
4/8 KB     
8/8 KB   
         
Downloaded: http://repo.maven.apache.org/maven2/org/apache/maven/plugins/maven-surefire-report-plugin/2.18.1/maven-surefire-report-plugin-2.18.1.pom
(8 KB at 388.5 KB/sec)
Downloading: http://repo.maven.apache.org/maven2/org/apache/maven/plugins/maven-surefire-report-plugin/2.18.1/maven-surefire-report-plugin-2.18.1.jar
4/40 KB   
7/40 KB   
11/40 KB   
15/40 KB   
19/40 KB   
21/40 KB   
25/40 KB   
28/40 KB   
32/40 KB   
35/40 KB   
39/40 KB   
40/40 KB   
           
Downloaded: http://repo.maven.apache.org/maven2/org/apache/maven/plugins/maven-surefire-report-plugin/2.18.1/maven-surefire-report-plugin-2.18.1.jar
(40 KB at 1627.0 KB/sec)
Downloading: http://repo.maven.apache.org/maven2/org/codehaus/mojo/cobertura-maven-plugin/2.6/cobertura-maven-plugin-2.6.pom
4/9 KB     
6/9 KB   
9/9 KB   
         
Downloaded: http://repo.maven.apache.org/maven2/org/codehaus/mojo/cobertura-maven-plugin/2.6/cobertura-maven-plugin-2.6.pom
(9 KB at 445.6 KB/sec)
Downloading: http://repo.maven.apache.org/maven2/org/codehaus/mojo/cobertura-maven-plugin/2.6/cobertura-maven-plugin-2.6.jar
4/48 KB   
7/48 KB   
11/48 KB   
15/48 KB   
19/48 KB   
21/48 KB   
25/48 KB   
28/48 KB   
32/48 KB   
35/48 KB   
39/48 KB   
42/48 KB   
46/48 KB   
48/48 KB   
           
Downloaded: http://repo.maven.apache.org/maven2/org/codehaus/mojo/cobertura-maven-plugin/2.6/cobertura-maven-plugin-2.6.jar
(48 KB at 1966.7 KB/sec)
Downloading: http://repo.maven.apache.org/maven2/org/codehaus/mojo/selenium-maven-plugin/2.3/selenium-maven-plugin-2.3.pom
4/13 KB    
7/13 KB   
11/13 KB   
13/13 KB   
           
Downloaded: http://repo.maven.apache.org/maven2/org/codehaus/mojo/selenium-maven-plugin/2.3/selenium-maven-plugin-2.3.pom
(13 KB at 671.6 KB/sec)
Downloading: http://repo.maven.apache.org/maven2/org/codehaus/mojo/selenium-maven-plugin/2.3/selenium-maven-plugin-2.3.jar
4/71 KB    
7/71 KB   
11/71 KB   
14/71 KB   
18/71 KB   
21/71 KB   
25/71 KB   
28/71 KB   
32/71 KB   
35/71 KB   
39/71 KB   
42/71 KB   
46/71 KB   
49/71 KB   
53/71 KB   
56/71 KB   
60/71 KB   
64/71 KB   
68/71 KB   
71/71 KB   
71/71 KB   
           
Downloaded: http://repo.maven.apache.org/maven2/org/codehaus/mojo/selenium-maven-plugin/2.3/selenium-maven-plugin-2.3.jar
(71 KB at 613.3 KB/sec)
Downloading: http://repo.maven.apache.org/maven2/org/codehaus/mojo/sonar-maven-plugin/2.2/sonar-maven-plugin-2.2.pom
4/6 KB     
6/6 KB   
         
Downloaded: http://repo.maven.apache.org/maven2/org/codehaus/mojo/sonar-maven-plugin/2.2/sonar-maven-plugin-2.2.pom
(6 KB at 27.0 KB/sec)
Downloading: http://repo.maven.apache.org/maven2/org/codehaus/mojo/sonar-maven-plugin/2.2/sonar-maven-plugin-2.2.jar
4/24 KB   
7/24 KB   
11/24 KB   
15/24 KB   
19/24 KB   
21/24 KB   
24/24 KB   
           
Downloaded: http://repo.maven.apache.org/maven2/org/codehaus/mojo/sonar-maven-plugin/2.2/sonar-maven-plugin-2.2.jar
(24 KB at 115.3 KB/sec)
[INFO]                                                                         
[INFO] ------------------------------------------------------------------------
[INFO] Building Apache JSPWiki 2.10.3-SNAPSHOT
[INFO] ------------------------------------------------------------------------
Downloading: http://repository.apache.org/snapshots/org/apache/jspwiki/jspwiki-war/2.10.3-SNAPSHOT/maven-metadata.xml
997/997 B   
            
Downloaded: http://repository.apache.org/snapshots/org/apache/jspwiki/jspwiki-war/2.10.3-SNAPSHOT/maven-metadata.xml
(997 B at 2.3 KB/sec)
[INFO] 
[INFO] --- sonar-maven-plugin:2.2:sonar (default-cli) @ jspwiki-builder ---
[INFO] ------------------------------------------------------------------------
[INFO] Reactor Summary:
[INFO] 
[INFO] Apache JSPWiki .................................... FAILURE [1.293s]
[INFO] Apache JSPWiki initial wiki pages builder ......... SKIPPED
[INFO] Apache JSPWiki initial wiki pages (de) ............ SKIPPED
[INFO] Apache JSPWiki initial wiki pages (en) ............ SKIPPED
[INFO] Apache JSPWiki initial wiki pages (es) ............ SKIPPED
[INFO] Apache JSPWiki initial wiki pages (fi) ............ SKIPPED
[INFO] Apache JSPWiki initial wiki pages (fr) ............ SKIPPED
[INFO] Apache JSPWiki initial wiki pages (it) ............ SKIPPED
[INFO] Apache JSPWiki initial wiki pages (nl) ............ SKIPPED
[INFO] Apache JSPWiki initial wiki pages (pt_BR) ......... SKIPPED
[INFO] Apache JSPWiki initial wiki pages (ru) ............ SKIPPED
[INFO] Apache JSPWiki initial wiki pages (zh_CN) ......... SKIPPED
[INFO] Apache JSPWiki Main War ........................... SKIPPED
[INFO] Apache JSPWiki portable ........................... SKIPPED
[INFO] jspwiki-it-builder ................................ SKIPPED
[INFO] jspwiki-selenium-tests ............................ SKIPPED
[INFO] jspwiki-it-test-custom ............................ SKIPPED
[INFO] jspwiki-it-test-custom-absolute-urls .............. SKIPPED
[INFO] jspwiki-it-test-custom-jdbc ....................... SKIPPED
[INFO] jspwiki-it-test-cma ............................... SKIPPED
[INFO] jspwiki-it-test-cma-jdbc .......................... SKIPPED
[INFO] ------------------------------------------------------------------------
[INFO] BUILD FAILURE
[INFO] ------------------------------------------------------------------------
[INFO] Total time: 4.637s
[INFO] Finished at: Tue Jan 17 19:15:42 UTC 2017
[INFO] Final Memory: 22M/1447M
[INFO] ------------------------------------------------------------------------
[ERROR] Failed to execute goal org.codehaus.mojo:sonar-maven-plugin:2.2:sonar (default-cli)
on project jspwiki-builder: SonarQube server can not be reached at https://builds.apache.org/analysis.
Please check the parameter 'sonar.host.url'. java.lang.RuntimeException: Could not generate
DH keypair: Prime size must be multiple of 64, and can only range from 512 to 1024 (inclusive)
-> [Help 1]
[ERROR] 
[ERROR] To see the full stack trace of the errors, re-run Maven with the -e switch.
[ERROR] Re-run Maven using the -X switch to enable full debug logging.
[ERROR] 
[ERROR] For more information about the errors and possible solutions, please read the following
articles:
[ERROR] [Help 1] http://cwiki.apache.org/confluence/display/MAVEN/MojoExecutionException
Build step 'Invoke top-level Maven targets' marked build as failure

Mime
View raw message