jspwiki-commits mailing list archives

Site index · List index
Message view « Date » · « Thread »
Top « Date » · « Thread »
From Apache Jenkins Server <jenk...@builds.apache.org>
Subject Build failed in Jenkins: JSPWiki #430
Date Sat, 17 Dec 2016 22:03:28 GMT
See <https://builds.apache.org/job/JSPWiki/430/changes>

Changes:

[brushed] Various HADDOCK updates & fixes

------------------------------------------
[...truncated 807 lines...]
[WARNING] MooEditable.CleanPaste.js:152:52:Insecure '^'.
[WARNING] MooEditable.CleanPaste.js:154:48:Insecure '^'.
[WARNING] MooEditable.CleanPaste.js:155:48:Insecure '^'.
[WARNING] MooEditable.CleanPaste.js:158:44:Insecure '^'.
[WARNING] MooEditable.CleanPaste.js:159:43:Insecure '^'.
[WARNING] MooEditable.CleanPaste.js:161:50:Insecure '^'.
[WARNING] MooEditable.CleanPaste.js:162:48:Insecure '^'.
[WARNING] MooEditable.CleanPaste.js:165:39:Insecure '^'.
[WARNING] MooEditable.CleanPaste.js:165:53:Insecure '^'.
[WARNING] MooEditable.CleanPaste.js:165:62:Insecure '^'.
[WARNING] MooEditable.CleanPaste.js:168:41:Insecure '^'.
[WARNING] MooEditable.CleanPaste.js:168:55:Insecure '^'.
[WARNING] MooEditable.CleanPaste.js:174:43:Insecure '^'.
[WARNING] MooEditable.CleanPaste.js:176:43:Insecure '^'.
[WARNING] MooEditable.CleanPaste.js:179:39:Insecure '^'.
[WARNING] MooEditable.CleanPaste.js:179:53:Insecure '^'.
[WARNING] MooEditable.CleanPaste.js:179:62:Insecure '^'.
[WARNING] MooEditable.CleanPaste.js:182:39:Insecure '^'.
[WARNING] MooEditable.CleanPaste.js:182:52:Insecure '^'.
[WARNING] MooEditable.CleanPaste.js:182:61:Insecure '^'.
[WARNING] MooEditable.CleanPaste.js:182:61:Too many errors. (68% scanned).
[WARNING] MooEditable.Group.js:23:1:'MooEditable' has not been fully defined yet.
[WARNING] MooEditable.Group.js:23:25:'Class' has not been fully defined yet.
[WARNING] MooEditable.Group.js:25:14:'Options' has not been fully defined yet.
[WARNING] MooEditable.Group.js:35:20:'MooEditable' is not defined.
[WARNING] MooEditable.Group.js:38:5:Combine this with the previous 'var' statement.
[WARNING] MooEditable.Group.js:39:25:Expected '{' and instead saw 'return'.
[WARNING] MooEditable.Group.js:42:28:Expected '===' and instead saw '=='.
[WARNING] MooEditable.Group.js:42:41:Expected '{' and instead saw 'self'.
[WARNING] MooEditable.Group.js:49:25:Expected ';' and instead saw '='.
[WARNING] MooEditable.Group.js:49:26:Unreachable '=' after 'return'.
[WARNING] MooEditable.Group.js:49:26:Expected an identifier and instead saw '='.
[WARNING] MooEditable.Group.js:49:26:Stopping.  (68% scanned).
[WARNING] MooEditable.Image.js:39:1:'MooEditable' has not been fully defined yet.
[WARNING] MooEditable.Image.js:50:1:'MooEditable' has not been fully defined yet.
[WARNING] MooEditable.Image.js:51:12:'MooEditable' is not defined.
[WARNING] MooEditable.Image.js:52:3:'MooEditable' is not defined.
[WARNING] MooEditable.Image.js:53:3:'MooEditable' is not defined.
[WARNING] MooEditable.Image.js:54:3:'MooEditable' is not defined.
[WARNING] MooEditable.Image.js:55:16:'MooEditable' is not defined.
[WARNING] MooEditable.Image.js:56:16:'MooEditable' is not defined.
[WARNING] MooEditable.Image.js:57:16:'MooEditable' is not defined.
[WARNING] MooEditable.Image.js:58:16:'MooEditable' is not defined.
[WARNING] MooEditable.Image.js:60:55:'MooEditable' is not defined.
[WARNING] MooEditable.Image.js:61:59:'MooEditable' is not defined.
[WARNING] MooEditable.Image.js:63:12:'MooEditable' is not defined.
[WARNING] MooEditable.Image.js:67:5:Combine this with the previous 'var' statement.
[WARNING] MooEditable.Image.js:68:21:Expected '===' and instead saw '=='.
[WARNING] MooEditable.Image.js:74:1:Do not wrap function literals in parens unless they are
to be immediately invoked.
[WARNING] MooEditable.Image.js:80:36:Expected '===' and instead saw '=='.
[WARNING] MooEditable.Image.js:80:49:Expected '{' and instead saw 'e'.
[WARNING] MooEditable.Image.js:86:5:Combine this with the previous 'var' statement.
[WARNING] MooEditable.Image.js:87:5:Combine this with the previous 'var' statement.
[WARNING] MooEditable.Image.js:88:21:Expected '===' and instead saw '=='.
[WARNING] MooEditable.Image.js:92:19:'$' is not defined.
[WARNING] MooEditable.Image.js:94:5:Combine this with the previous 'var' statement.
[WARNING] MooEditable.Image.js:94:15:'Element' is not defined.
[WARNING] MooEditable.Image.js:95:5:'Element' is not defined.
[WARNING] MooEditable.Image.js:99:8:'$' is not defined.
[WARNING] MooEditable.Image.js:108:1:'MooEditable' has not been fully defined yet.
[WARNING] MooEditable.Image.js:109:8:'MooEditable' has not been fully defined yet.
[WARNING] MooEditable.Image.js:115:8:'MooEditable' is not defined.
[WARNING] MooEditable.js:41:5:Combine this with the previous 'var' statement.
[WARNING] MooEditable.js:41:62:Unescaped '-'.
[WARNING] MooEditable.js:41:85:Unescaped '-'.
[WARNING] MooEditable.js:42:5:Combine this with the previous 'var' statement.
[WARNING] MooEditable.js:44:24:'Class' is not defined.
[WARNING] MooEditable.js:46:14:'Events' is not defined.
[WARNING] MooEditable.js:46:22:'Options' is not defined.
[WARNING] MooEditable.js:70:25:Unexpected 'in'. Compare with undefined, or use the hasOwnProperty
method instead.
[WARNING] MooEditable.js:70:61:Unexpected 'in'. Compare with undefined, or use the hasOwnProperty
method instead.
[WARNING] MooEditable.js:70:43:Weird condition.
[WARNING] MooEditable.js:82:11:'MooEditable' is not defined.
[WARNING] MooEditable.js:83:11:Expected '{' and instead saw 'return'.
[WARNING] MooEditable.js:85:5:Combine this with the previous 'var' statement.
[WARNING] MooEditable.js:86:10:Expected '{' and instead saw 'this'.
[WARNING] MooEditable.js:92:5:'typeOf' is not defined.
[WARNING] MooEditable.js:92:34:Expected '!==' and instead saw '!='.
[WARNING] MooEditable.js:92:47:Expected '{' and instead saw 'this'.
[WARNING] MooEditable.js:113:5:Combine this with the previous 'var' statement.
[WARNING] MooEditable.js:116:22:'Element' is not defined.
[WARNING] MooEditable.js:128:19:'IFrame' is not defined.
[WARNING] MooEditable.js:131:6:JavaScript URL.
[WARNING] MooEditable.js:137:20:'MooEditable' is not defined.
[WARNING] MooEditable.js:140:5:Combine this with the previous 'var' statement.
[WARNING] MooEditable.js:147:51:Expected '{' and instead saw '$$'.
[WARNING] MooEditable.js:147:51:'$$' is not defined.
[WARNING] MooEditable.js:148:15:Expected '!==' and instead saw '!='.
[WARNING] MooEditable.js:148:28:Expected '{' and instead saw 'return'.
[WARNING] MooEditable.js:158:15:Expected '===' and instead saw '=='.
[WARNING] MooEditable.js:158:28:Expected '{' and instead saw 'self'.
[WARNING] MooEditable.js:197:12:Expected '{' and instead saw 'self'.
[WARNING] MooEditable.js:209:5:'Browser' is not defined.
[WARNING] MooEditable.js:209:22:Expected '{' and instead saw 'this'.
[WARNING] MooEditable.js:212:5:Combine this with the previous 'var' statement.
[WARNING] MooEditable.js:224:2:'Browser' is not defined.
[WARNING] MooEditable.js:224:77:Expected an assignment or function call and instead saw an
expression.
[WARNING] MooEditable.js:227:29:'Window' is not defined.
[WARNING] MooEditable.js:227:35:Missing '()'.
[WARNING] MooEditable.js:228:29:'Document' is not defined.
[WARNING] MooEditable.js:228:37:Missing '()'.
[WARNING] MooEditable.js:229:5:'Browser' is not defined.
[WARNING] MooEditable.js:230:5:Combine this with the previous 'var' statement.
[WARNING] MooEditable.js:231:6:Move 'var' declarations to the top of the function.
[WARNING] MooEditable.js:231:6:Stopping.  (14% scanned).
[WARNING] MooEditable.Table.js:53:1:'MooEditable' has not been fully defined yet.
[WARNING] MooEditable.Table.js:84:1:'MooEditable' has not been fully defined yet.
[WARNING] MooEditable.Table.js:86:11:'MooEditable' is not defined.
[WARNING] MooEditable.Table.js:87:3:'MooEditable' is not defined.
[WARNING] MooEditable.Table.js:88:12:'MooEditable' is not defined.
[WARNING] MooEditable.Table.js:89:3:'MooEditable' is not defined.
[WARNING] MooEditable.Table.js:90:15:'MooEditable' is not defined.
[WARNING] MooEditable.Table.js:91:3:'MooEditable' is not defined.
[WARNING] MooEditable.Table.js:92:27:'MooEditable' is not defined.
[WARNING] MooEditable.Table.js:93:27:'MooEditable' is not defined.
[WARNING] MooEditable.Table.js:95:15:'MooEditable' is not defined.
[WARNING] MooEditable.Table.js:96:3:'MooEditable' is not defined.
[WARNING] MooEditable.Table.js:97:3:'MooEditable' is not defined.
[WARNING] MooEditable.Table.js:98:16:'MooEditable' is not defined.
[WARNING] MooEditable.Table.js:99:16:'MooEditable' is not defined.
[WARNING] MooEditable.Table.js:100:16:'MooEditable' is not defined.
[WARNING] MooEditable.Table.js:101:16:'MooEditable' is not defined.
[WARNING] MooEditable.Table.js:103:3:'MooEditable' is not defined.
[WARNING] MooEditable.Table.js:104:16:'MooEditable' is not defined.
[WARNING] MooEditable.Table.js:105:16:'MooEditable' is not defined.
[WARNING] MooEditable.Table.js:106:16:'MooEditable' is not defined.
[WARNING] MooEditable.Table.js:107:16:'MooEditable' is not defined.
[WARNING] MooEditable.Table.js:110:69:'MooEditable' is not defined.
[WARNING] MooEditable.Table.js:111:59:'MooEditable' is not defined.
[WARNING] MooEditable.Table.js:113:5:Combine this with the previous 'var' statement.
[WARNING] MooEditable.Table.js:117:5:Combine this with the previous 'var' statement.
[WARNING] MooEditable.Table.js:118:24:Expected '{' and instead saw 'return'.
[WARNING] MooEditable.Table.js:119:5:Combine this with the previous 'var' statement.
[WARNING] MooEditable.Table.js:120:11:'Element' is not defined.
[WARNING] MooEditable.Table.js:121:13:'Element' is not defined.
[WARNING] MooEditable.Table.js:122:13:'Element' is not defined.
[WARNING] MooEditable.Table.js:123:6:Move 'var' declarations to the top of the function.
[WARNING] MooEditable.Table.js:123:6:Stopping.  (32% scanned).
[WARNING] MooEditable.Flash.js:40:1:'MooEditable' has not been fully defined yet.
[WARNING] MooEditable.Flash.js:45:1:'MooEditable' has not been fully defined yet.
[WARNING] MooEditable.Flash.js:46:12:'MooEditable' is not defined.
[WARNING] MooEditable.Flash.js:47:55:'MooEditable' is not defined.
[WARNING] MooEditable.Flash.js:48:59:'MooEditable' is not defined.
[WARNING] MooEditable.Flash.js:49:12:'MooEditable' is not defined.
[WARNING] MooEditable.Flash.js:53:1:Do not wrap function literals in parens unless they are
to be immediately invoked.
[WARNING] MooEditable.Flash.js:59:36:Expected '===' and instead saw '=='.
[WARNING] MooEditable.Flash.js:59:49:Expected '{' and instead saw 'e'.
[WARNING] MooEditable.Flash.js:65:5:Combine this with the previous 'var' statement.
[WARNING] MooEditable.Flash.js:65:15:'Element' is not defined.
[WARNING] MooEditable.Flash.js:72:1:'MooEditable' has not been fully defined yet.
[WARNING] MooEditable.Flash.js:73:8:'MooEditable' has not been fully defined yet.
[WARNING] MooEditable.Flash.js:76:8:'MooEditable' is not defined.
[WARNING] MooEditable.UI.MenuList.js:22:1:'MooEditable' has not been fully defined yet.
[WARNING] MooEditable.UI.MenuList.js:22:31:'Class' has not been fully defined yet.
[WARNING] MooEditable.UI.MenuList.js:24:14:'Events' has not been fully defined yet.
[WARNING] MooEditable.UI.MenuList.js:24:22:'Options' has not been fully defined yet.
[WARNING] MooEditable.UI.MenuList.js:48:5:Combine this with the previous 'var' statement.
[WARNING] MooEditable.UI.MenuList.js:52:15:'Element' is not defined.
[WARNING] MooEditable.UI.MenuList.js:65:5:'Browser' is not defined.
[WARNING] MooEditable.UI.MenuList.js:65:17:Expected '{' and instead saw 'this'.
[WARNING] MooEditable.UI.MenuList.js:75:20:Expected '{' and instead saw 'return'.
[WARNING] MooEditable.UI.MenuList.js:85:21:Expected '{' and instead saw 'return'.
[WARNING] MooEditable.UI.MenuList.js:95:20:Expected '{' and instead saw 'return'.
[WARNING] MooEditable.UI.MenuList.js:105:20:Expected '{' and instead saw 'return'.
[WARNING] MooEditable.UI.MenuList.js:107:12:Expected '{' and instead saw 'this'.
[WARNING] MooEditable.UI.MenuList.js:108:16:Expected '===' and instead saw '=='.
[WARNING] MooEditable.UI.MenuList.js:108:26:Expected '{' and instead saw 'index'.
[INFO] 
[INFO] --- jslint-maven-plugin:1.0.1:jslint (checkThirdParty) @ jspwiki-war ---
[INFO] 
[INFO] --- maven-remote-resources-plugin:1.5:process (default) @ jspwiki-war ---
[INFO] 
[INFO] --- maven-resources-plugin:2.7:resources (default-resources) @ jspwiki-war ---
[INFO] Using 'UTF-8' encoding to copy filtered resources.
[INFO] Copying 37 resources
[INFO] Copying 3 resources
[INFO] 
[INFO] --- maven-compiler-plugin:3.3:compile (default-compile) @ jspwiki-war ---
[INFO] Changes detected - recompiling the module!
[INFO] Compiling 353 source files to <https://builds.apache.org/job/JSPWiki/ws/jspwiki-war/target/classes>
[INFO] Some input files use or override a deprecated API.
[INFO] Recompile with -Xlint:deprecation for details.
[INFO] Some input files use unchecked or unsafe operations.
[INFO] Recompile with -Xlint:unchecked for details.
[INFO] 
[INFO] --- maven-resources-plugin:2.7:testResources (default-testResources) @ jspwiki-war
---
[INFO] Using 'UTF-8' encoding to copy filtered resources.
[INFO] Copying 12 resources
[INFO] Copying 3 resources
[INFO] 
[INFO] --- maven-compiler-plugin:3.3:testCompile (default-testCompile) @ jspwiki-war ---
[INFO] Changes detected - recompiling the module!
[INFO] Compiling 138 source files to <https://builds.apache.org/job/JSPWiki/ws/jspwiki-war/target/test-classes>
[INFO] <https://builds.apache.org/job/JSPWiki/ws/jspwiki-war/src/test/java/org/apache/wiki/auth/AuthenticationManagerTest.java>
uses or overrides a deprecated API.
[INFO] Recompile with -Xlint:deprecation for details.
[INFO] Some input files use unchecked or unsafe operations.
[INFO] Recompile with -Xlint:unchecked for details.
[INFO] -------------------------------------------------------------
[ERROR] COMPILATION ERROR : 
[INFO] -------------------------------------------------------------
[ERROR] <https://builds.apache.org/job/JSPWiki/ws/jspwiki-war/src/test/java/org/apache/wiki/rss/RSSGeneratorTest.java>:[87,39]
findBlogEntries(org.apache.wiki.WikiEngine,java.lang.String,java.util.Date,java.util.Date)
in org.apache.wiki.plugin.WeblogPlugin cannot be applied to (org.apache.wiki.PageManager,java.lang.String,java.util.Date,java.util.Date)
[ERROR] <https://builds.apache.org/job/JSPWiki/ws/jspwiki-war/src/test/java/org/apache/wiki/rss/RSSGeneratorTest.java>:[117,39]
findBlogEntries(org.apache.wiki.WikiEngine,java.lang.String,java.util.Date,java.util.Date)
in org.apache.wiki.plugin.WeblogPlugin cannot be applied to (org.apache.wiki.PageManager,java.lang.String,java.util.Date,java.util.Date)
[INFO] 2 errors 
[INFO] -------------------------------------------------------------
[INFO] ------------------------------------------------------------------------
[INFO] Reactor Summary:
[INFO] 
[INFO] Apache JSPWiki .................................... SUCCESS [1.611s]
[INFO] Apache JSPWiki initial wiki pages builder ......... SUCCESS [0.055s]
[INFO] Apache JSPWiki initial wiki pages (de) ............ SUCCESS [1.178s]
[INFO] Apache JSPWiki initial wiki pages (en) ............ SUCCESS [0.273s]
[INFO] Apache JSPWiki initial wiki pages (es) ............ SUCCESS [0.194s]
[INFO] Apache JSPWiki initial wiki pages (fi) ............ SUCCESS [0.170s]
[INFO] Apache JSPWiki initial wiki pages (fr) ............ SUCCESS [0.229s]
[INFO] Apache JSPWiki initial wiki pages (it) ............ SUCCESS [0.206s]
[INFO] Apache JSPWiki initial wiki pages (nl) ............ SUCCESS [0.189s]
[INFO] Apache JSPWiki initial wiki pages (pt_BR) ......... SUCCESS [0.226s]
[INFO] Apache JSPWiki initial wiki pages (ru) ............ SUCCESS [0.187s]
[INFO] Apache JSPWiki initial wiki pages (zh_CN) ......... SUCCESS [0.225s]
[INFO] Apache JSPWiki Main War ........................... FAILURE [8.546s]
[INFO] Apache JSPWiki portable ........................... SKIPPED
[INFO] jspwiki-it-builder ................................ SKIPPED
[INFO] jspwiki-selenium-tests ............................ SKIPPED
[INFO] jspwiki-it-test-custom ............................ SKIPPED
[INFO] jspwiki-it-test-custom-absolute-urls .............. SKIPPED
[INFO] jspwiki-it-test-custom-jdbc ....................... SKIPPED
[INFO] jspwiki-it-test-cma ............................... SKIPPED
[INFO] jspwiki-it-test-cma-jdbc .......................... SKIPPED
[INFO] ------------------------------------------------------------------------
[INFO] BUILD FAILURE
[INFO] ------------------------------------------------------------------------
[INFO] Total time: 14.283s
[INFO] Finished at: Sat Dec 17 22:03:40 UTC 2016
[INFO] Final Memory: 45M/2532M
[INFO] ------------------------------------------------------------------------
[ERROR] Failed to execute goal org.apache.maven.plugins:maven-compiler-plugin:3.3:testCompile
(default-testCompile) on project jspwiki-war: Compilation failure: Compilation failure:
[ERROR] <https://builds.apache.org/job/JSPWiki/ws/jspwiki-war/src/test/java/org/apache/wiki/rss/RSSGeneratorTest.java>:[87,39]
findBlogEntries(org.apache.wiki.WikiEngine,java.lang.String,java.util.Date,java.util.Date)
in org.apache.wiki.plugin.WeblogPlugin cannot be applied to (org.apache.wiki.PageManager,java.lang.String,java.util.Date,java.util.Date)
[ERROR] <https://builds.apache.org/job/JSPWiki/ws/jspwiki-war/src/test/java/org/apache/wiki/rss/RSSGeneratorTest.java>:[117,39]
findBlogEntries(org.apache.wiki.WikiEngine,java.lang.String,java.util.Date,java.util.Date)
in org.apache.wiki.plugin.WeblogPlugin cannot be applied to (org.apache.wiki.PageManager,java.lang.String,java.util.Date,java.util.Date)
[ERROR] -> [Help 1]
[ERROR] 
[ERROR] To see the full stack trace of the errors, re-run Maven with the -e switch.
[ERROR] Re-run Maven using the -X switch to enable full debug logging.
[ERROR] 
[ERROR] For more information about the errors and possible solutions, please read the following
articles:
[ERROR] [Help 1] http://cwiki.apache.org/confluence/display/MAVEN/MojoFailureException
[ERROR] 
[ERROR] After correcting the problems, you can resume the build with the command
[ERROR]   mvn <goals> -rf :jspwiki-war
Build step 'Invoke top-level Maven targets' marked build as failure

Mime
View raw message