jspwiki-commits mailing list archives

Site index · List index
Message view « Date » · « Thread »
Top « Date » · « Thread »
From Apache Jenkins Server <jenk...@builds.apache.org>
Subject Build failed in Jenkins: JSPWiki #365
Date Sun, 02 Aug 2015 19:22:44 GMT
See <https://builds.apache.org/job/JSPWiki/365/changes>

Changes:

[brushed] * 2.10.2-svn-29  HADDOCK template improvements & WYSIWYG improvements
       * [JSPWIKI-430] confirmation dialogs build with regular DOM elements 
       * Added support for the WYSIWYG editor TinyMCE.jsp
       * [JSPWIKI-622] Added an editor selection switch to the editor toolbar.

------------------------------------------
[...truncated 790 lines...]
Running org.apache.wiki.auth.GroupManagerTest
Tests run: 4, Failures: 0, Errors: 0, Skipped: 0, Time elapsed: 0.075 sec - in org.apache.wiki.auth.GroupManagerTest
Running org.apache.wiki.auth.user.JDBCUserDatabaseTest
[Server@cb9e2]: [Thread[main,5,main]]: setSilent(true)
[Server@1d1c815]: [Thread[main,5,main]]: setSilent(true)
[Server@beaff3]: [Thread[main,5,main]]: setSilent(true)
[Server@15e2025]: [Thread[main,5,main]]: setSilent(true)
[Server@bad6a1]: [Thread[main,5,main]]: setSilent(true)
[Server@fe766d]: [Thread[main,5,main]]: setSilent(true)
[Server@1f9f4eb]: [Thread[main,5,main]]: setSilent(true)
[Server@1eaa2bd]: [Thread[main,5,main]]: setSilent(true)
[Server@19865f9]: [Thread[main,5,main]]: setSilent(true)
[Server@1de36ca]: [Thread[main,5,main]]: setSilent(true)
[Server@37c708]: [Thread[main,5,main]]: setSilent(true)
Tests run: 11, Failures: 0, Errors: 0, Skipped: 0, Time elapsed: 20.738 sec - in org.apache.wiki.auth.user.JDBCUserDatabaseTest
Running org.apache.wiki.auth.user.UserProfileTest
Tests run: 5, Failures: 0, Errors: 0, Skipped: 0, Time elapsed: 0.062 sec - in org.apache.wiki.auth.user.UserProfileTest
Running org.apache.wiki.auth.user.XMLUserDatabaseTest
Tests run: 11, Failures: 0, Errors: 0, Skipped: 0, Time elapsed: 0.127 sec - in org.apache.wiki.auth.user.XMLUserDatabaseTest
Running org.apache.wiki.auth.AuthenticationManagerTest
Tests run: 6, Failures: 0, Errors: 0, Skipped: 0, Time elapsed: 0.107 sec - in org.apache.wiki.auth.AuthenticationManagerTest
Running org.apache.wiki.auth.acl.AclImplTest
Tests run: 6, Failures: 0, Errors: 0, Skipped: 0, Time elapsed: 0.086 sec - in org.apache.wiki.auth.acl.AclImplTest
Running org.apache.wiki.auth.acl.AclEntryImplTest
Tests run: 7, Failures: 0, Errors: 0, Skipped: 0, Time elapsed: 0 sec - in org.apache.wiki.auth.acl.AclEntryImplTest
Running org.apache.wiki.auth.acl.DefaultAclManagerTest
Tests run: 3, Failures: 0, Errors: 0, Skipped: 0, Time elapsed: 0.245 sec - in org.apache.wiki.auth.acl.DefaultAclManagerTest
Running org.apache.wiki.auth.UserManagerTest
Tests run: 5, Failures: 0, Errors: 0, Skipped: 0, Time elapsed: 0.234 sec - in org.apache.wiki.auth.UserManagerTest
Running org.apache.wiki.auth.permissions.GroupPermissionTest
Tests run: 10, Failures: 0, Errors: 0, Skipped: 0, Time elapsed: 0.002 sec - in org.apache.wiki.auth.permissions.GroupPermissionTest
Running org.apache.wiki.auth.permissions.AllPermissionCollectionTest
Tests run: 8, Failures: 0, Errors: 0, Skipped: 0, Time elapsed: 0.001 sec - in org.apache.wiki.auth.permissions.AllPermissionCollectionTest
Running org.apache.wiki.auth.permissions.AllPermissionTest
Tests run: 5, Failures: 0, Errors: 0, Skipped: 0, Time elapsed: 0.001 sec - in org.apache.wiki.auth.permissions.AllPermissionTest
Running org.apache.wiki.auth.permissions.PagePermissionTest
Tests run: 10, Failures: 0, Errors: 0, Skipped: 0, Time elapsed: 0.002 sec - in org.apache.wiki.auth.permissions.PagePermissionTest
Running org.apache.wiki.auth.permissions.WikiPermissionTest
Tests run: 10, Failures: 0, Errors: 0, Skipped: 0, Time elapsed: 0.001 sec - in org.apache.wiki.auth.permissions.WikiPermissionTest
Running org.apache.wiki.auth.AuthorizationManagerTest
Tests run: 17, Failures: 0, Errors: 0, Skipped: 0, Time elapsed: 0.362 sec - in org.apache.wiki.auth.AuthorizationManagerTest
Running org.apache.wiki.workflow.DecisionQueueTest
Tests run: 7, Failures: 0, Errors: 0, Skipped: 0, Time elapsed: 0.085 sec - in org.apache.wiki.workflow.DecisionQueueTest
Running org.apache.wiki.workflow.SimpleDecisionTest
Tests run: 16, Failures: 0, Errors: 0, Skipped: 0, Time elapsed: 0.001 sec - in org.apache.wiki.workflow.SimpleDecisionTest
Running org.apache.wiki.workflow.TaskTest
Tests run: 12, Failures: 0, Errors: 0, Skipped: 0, Time elapsed: 0.001 sec - in org.apache.wiki.workflow.TaskTest
Running org.apache.wiki.workflow.ApprovalWorkflowTest
Tests run: 5, Failures: 0, Errors: 0, Skipped: 0, Time elapsed: 0.081 sec - in org.apache.wiki.workflow.ApprovalWorkflowTest
Running org.apache.wiki.workflow.WorkflowManagerTest
Tests run: 4, Failures: 0, Errors: 0, Skipped: 0, Time elapsed: 0.038 sec - in org.apache.wiki.workflow.WorkflowManagerTest
Running org.apache.wiki.workflow.FactTest
Tests run: 1, Failures: 0, Errors: 0, Skipped: 0, Time elapsed: 0 sec - in org.apache.wiki.workflow.FactTest
Running org.apache.wiki.workflow.WorkflowTest
Tests run: 24, Failures: 0, Errors: 0, Skipped: 0, Time elapsed: 0.003 sec - in org.apache.wiki.workflow.WorkflowTest
Running org.apache.wiki.workflow.OutcomeTest
Tests run: 6, Failures: 0, Errors: 0, Skipped: 0, Time elapsed: 0.009 sec - in org.apache.wiki.workflow.OutcomeTest
Running org.apache.wiki.util.SerializerTest
Tests run: 1, Failures: 0, Errors: 0, Skipped: 0, Time elapsed: 0 sec - in org.apache.wiki.util.SerializerTest
Running org.apache.wiki.util.ByteUtilsTest
Tests run: 3, Failures: 0, Errors: 0, Skipped: 0, Time elapsed: 0 sec - in org.apache.wiki.util.ByteUtilsTest
Running org.apache.wiki.util.ClassUtilTest
Tests run: 3, Failures: 0, Errors: 0, Skipped: 0, Time elapsed: 0.055 sec - in org.apache.wiki.util.ClassUtilTest
Running org.apache.wiki.util.TimedCounterListTest
Tests run: 2, Failures: 0, Errors: 0, Skipped: 0, Time elapsed: 0.11 sec - in org.apache.wiki.util.TimedCounterListTest
Running org.apache.wiki.util.XmlUtilTest
Tests run: 2, Failures: 0, Errors: 0, Skipped: 0, Time elapsed: 0.01 sec - in org.apache.wiki.util.XmlUtilTest
Running org.apache.wiki.util.CommentedPropertiesTest
Tests run: 4, Failures: 0, Errors: 0, Skipped: 0, Time elapsed: 0.002 sec - in org.apache.wiki.util.CommentedPropertiesTest
Running org.apache.wiki.util.TextUtilTest
Tests run: 42, Failures: 0, Errors: 0, Skipped: 0, Time elapsed: 0.041 sec - in org.apache.wiki.util.TextUtilTest
Running org.apache.wiki.util.FileUtilTest
Tests run: 5, Failures: 0, Errors: 0, Skipped: 0, Time elapsed: 0.015 sec - in org.apache.wiki.util.FileUtilTest
Running org.apache.wiki.util.MailUtilTest
I could not test whether mail sending works, since I could not connect to your SMTP server.
Reason: Could not connect to SMTP host: 127.0.0.1, port: 25
Tests run: 2, Failures: 0, Errors: 0, Skipped: 0, Time elapsed: 0.025 sec - in org.apache.wiki.util.MailUtilTest
Running org.apache.wiki.util.CryptoUtilTest
Tests run: 8, Failures: 0, Errors: 0, Skipped: 0, Time elapsed: 0.001 sec - in org.apache.wiki.util.CryptoUtilTest
Running org.apache.wiki.util.comparators.HumanComparatorTest
Tests run: 2, Failures: 0, Errors: 0, Skipped: 0, Time elapsed: 0 sec - in org.apache.wiki.util.comparators.HumanComparatorTest
Running org.apache.wiki.util.PriorityListTest
Tests run: 4, Failures: 0, Errors: 0, Skipped: 0, Time elapsed: 0 sec - in org.apache.wiki.util.PriorityListTest
Running org.apache.wiki.util.UtilJ2eeCompatTest
Tests run: 6, Failures: 0, Errors: 0, Skipped: 0, Time elapsed: 0 sec - in org.apache.wiki.util.UtilJ2eeCompatTest
Running org.apache.wiki.util.PropertyReaderTest
Tests run: 1, Failures: 0, Errors: 0, Skipped: 0, Time elapsed: 0.001 sec - in org.apache.wiki.util.PropertyReaderTest
Running org.apache.wiki.diff.ContextualDiffProviderTest
Tests run: 6, Failures: 0, Errors: 0, Skipped: 0, Time elapsed: 1.875 sec - in org.apache.wiki.diff.ContextualDiffProviderTest
Running org.apache.wiki.search.SearchManagerTest
Tests run: 7, Failures: 0, Errors: 0, Skipped: 0, Time elapsed: 12.737 sec - in org.apache.wiki.search.SearchManagerTest
Running org.apache.wiki.content.PageRenamerTest
Tests run: 21, Failures: 0, Errors: 0, Skipped: 0, Time elapsed: 2.094 sec - in org.apache.wiki.content.PageRenamerTest
Running org.apache.wiki.WikiAjaxServletTest
Tests run: 1, Failures: 0, Errors: 0, Skipped: 0, Time elapsed: 0.044 sec - in org.apache.wiki.WikiAjaxServletTest
Running org.apache.wiki.htmltowiki.HtmlStringToWikiTranslatorTest
Tests run: 17, Failures: 2, Errors: 0, Skipped: 0, Time elapsed: 0.116 sec <<< FAILURE!
- in org.apache.wiki.htmltowiki.HtmlStringToWikiTranslatorTest
testCSS(org.apache.wiki.htmltowiki.HtmlStringToWikiTranslatorTest)  Time elapsed: 0.059 sec
 <<< FAILURE!
junit.framework.ComparisonFailure: expected:<...emand wird sie sehen[%]%, die> but was:<...emand
wird sie sehen[/]%, die>
	at junit.framework.Assert.assertEquals(Assert.java:100)
	at junit.framework.Assert.assertEquals(Assert.java:107)
	at junit.framework.TestCase.assertEquals(TestCase.java:269)
	at org.apache.wiki.htmltowiki.HtmlStringToWikiTranslatorTest.testCSS(HtmlStringToWikiTranslatorTest.java:293)

testCenter(org.apache.wiki.htmltowiki.HtmlStringToWikiTranslatorTest)  Time elapsed: 0.001
sec  <<< FAILURE!
junit.framework.ComparisonFailure: expected:<...; )
Hello \\
World!
[%]%
> but was:<...; )
Hello \\
World!
[/]%
>
	at junit.framework.Assert.assertEquals(Assert.java:100)
	at junit.framework.Assert.assertEquals(Assert.java:107)
	at junit.framework.TestCase.assertEquals(TestCase.java:269)
	at org.apache.wiki.htmltowiki.HtmlStringToWikiTranslatorTest.testCenter(HtmlStringToWikiTranslatorTest.java:220)

Running org.apache.wiki.plugin.TableOfContentsTest
Tests run: 8, Failures: 0, Errors: 0, Skipped: 0, Time elapsed: 0.206 sec - in org.apache.wiki.plugin.TableOfContentsTest
Running org.apache.wiki.plugin.ReferringPagesPluginTest
Tests run: 8, Failures: 0, Errors: 0, Skipped: 0, Time elapsed: 0.895 sec - in org.apache.wiki.plugin.ReferringPagesPluginTest
Running org.apache.wiki.plugin.UndefinedPagesPluginTest
Tests run: 2, Failures: 0, Errors: 0, Skipped: 0, Time elapsed: 0.138 sec - in org.apache.wiki.plugin.UndefinedPagesPluginTest
Running org.apache.wiki.plugin.ReferringUndefinedPagesPluginTest
Tests run: 4, Failures: 0, Errors: 0, Skipped: 0, Time elapsed: 0.306 sec - in org.apache.wiki.plugin.ReferringUndefinedPagesPluginTest
Running org.apache.wiki.plugin.RecentChangesPluginTest
Tests run: 4, Failures: 0, Errors: 0, Skipped: 0, Time elapsed: 0.365 sec - in org.apache.wiki.plugin.RecentChangesPluginTest
Running org.apache.wiki.plugin.CounterPluginTest
Tests run: 6, Failures: 0, Errors: 0, Skipped: 0, Time elapsed: 0.065 sec - in org.apache.wiki.plugin.CounterPluginTest
Running org.apache.wiki.plugin.InsertPageTest
Tests run: 6, Failures: 0, Errors: 0, Skipped: 0, Time elapsed: 0.134 sec - in org.apache.wiki.plugin.InsertPageTest
Running org.apache.wiki.plugin.PageViewPluginTest
Tests run: 4, Failures: 0, Errors: 0, Skipped: 0, Time elapsed: 0.317 sec - in org.apache.wiki.plugin.PageViewPluginTest
Running org.apache.wiki.plugin.DefaultPluginManagerTest
Tests run: 15, Failures: 0, Errors: 0, Skipped: 0, Time elapsed: 0.154 sec - in org.apache.wiki.plugin.DefaultPluginManagerTest
Running org.apache.wiki.plugin.GroupsTest
Tests run: 1, Failures: 0, Errors: 0, Skipped: 0, Time elapsed: 0.018 sec - in org.apache.wiki.plugin.GroupsTest
Running org.apache.wiki.plugin.IfPluginTest
Tests run: 4, Failures: 0, Errors: 0, Skipped: 0, Time elapsed: 0.098 sec - in org.apache.wiki.plugin.IfPluginTest
Running org.apache.wiki.i18n.InternationalizationManagerTest
Tests run: 2, Failures: 0, Errors: 0, Skipped: 0, Time elapsed: 0 sec - in org.apache.wiki.i18n.InternationalizationManagerTest
Running org.apache.wiki.providers.VersioningFileProviderTest
Tests run: 20, Failures: 0, Errors: 0, Skipped: 0, Time elapsed: 2.031 sec - in org.apache.wiki.providers.VersioningFileProviderTest
Running org.apache.wiki.providers.BasicAttachmentProviderTest
Tests run: 12, Failures: 0, Errors: 0, Skipped: 0, Time elapsed: 10.459 sec - in org.apache.wiki.providers.BasicAttachmentProviderTest
Running org.apache.wiki.providers.FileSystemProviderTest
Tests run: 10, Failures: 0, Errors: 0, Skipped: 0, Time elapsed: 0.095 sec - in org.apache.wiki.providers.FileSystemProviderTest
Running org.apache.wiki.providers.CachingProviderTest
Tests run: 2, Failures: 0, Errors: 0, Skipped: 0, Time elapsed: 4.087 sec - in org.apache.wiki.providers.CachingProviderTest
Running org.apache.wiki.attachment.AttachmentManagerTest
Tests run: 14, Failures: 0, Errors: 0, Skipped: 0, Time elapsed: 1.228 sec - in org.apache.wiki.attachment.AttachmentManagerTest
Running org.apache.wiki.ReferenceManagerTest
Tests run: 18, Failures: 0, Errors: 0, Skipped: 0, Time elapsed: 1.415 sec - in org.apache.wiki.ReferenceManagerTest
Running org.apache.wiki.render.RenderingManagerTest
Tests run: 1, Failures: 0, Errors: 0, Skipped: 0, Time elapsed: 0.597 sec - in org.apache.wiki.render.RenderingManagerTest
Running org.apache.wiki.render.CreoleRendererTest
Tests run: 14, Failures: 0, Errors: 0, Skipped: 0, Time elapsed: 0.191 sec - in org.apache.wiki.render.CreoleRendererTest
Running org.apache.wiki.render.WysiwygEditingRendererTest
Tests run: 2, Failures: 0, Errors: 0, Skipped: 0, Time elapsed: 0.047 sec - in org.apache.wiki.render.WysiwygEditingRendererTest
Running org.apache.wiki.ui.WikiCommandTest
Tests run: 2, Failures: 0, Errors: 0, Skipped: 0, Time elapsed: 0.016 sec - in org.apache.wiki.ui.WikiCommandTest
Running org.apache.wiki.ui.RedirectCommandTest
Tests run: 2, Failures: 0, Errors: 0, Skipped: 0, Time elapsed: 0 sec - in org.apache.wiki.ui.RedirectCommandTest
Running org.apache.wiki.ui.admin.beans.PluginBeanTest
Tests run: 1, Failures: 0, Errors: 0, Skipped: 0, Time elapsed: 0.007 sec - in org.apache.wiki.ui.admin.beans.PluginBeanTest
Running org.apache.wiki.ui.GroupCommandTest
Tests run: 2, Failures: 0, Errors: 0, Skipped: 0, Time elapsed: 0.016 sec - in org.apache.wiki.ui.GroupCommandTest
Running org.apache.wiki.ui.CommandResolverTest
Tests run: 6, Failures: 0, Errors: 0, Skipped: 0, Time elapsed: 0.211 sec - in org.apache.wiki.ui.CommandResolverTest
Running org.apache.wiki.ui.PageCommandTest
Tests run: 2, Failures: 0, Errors: 0, Skipped: 0, Time elapsed: 0.042 sec - in org.apache.wiki.ui.PageCommandTest
Running org.apache.wiki.ui.InputValidatorTest
Tests run: 4, Failures: 0, Errors: 0, Skipped: 0, Time elapsed: 0.032 sec - in org.apache.wiki.ui.InputValidatorTest
Running org.apache.wiki.PropertyReaderTest
Tests run: 3, Failures: 0, Errors: 0, Skipped: 0, Time elapsed: 0 sec - in org.apache.wiki.PropertyReaderTest
Running org.apache.wiki.url.ShortViewURLConstructorTest
Tests run: 12, Failures: 0, Errors: 0, Skipped: 0, Time elapsed: 0.092 sec - in org.apache.wiki.url.ShortViewURLConstructorTest
Running org.apache.wiki.url.DefaultURLConstructorTest
Tests run: 12, Failures: 0, Errors: 0, Skipped: 0, Time elapsed: 0.09 sec - in org.apache.wiki.url.DefaultURLConstructorTest
Running org.apache.wiki.url.ShortURLConstructorTest
Tests run: 12, Failures: 0, Errors: 0, Skipped: 0, Time elapsed: 0.093 sec - in org.apache.wiki.url.ShortURLConstructorTest
Running org.apache.wiki.VariableManagerTest
Tests run: 12, Failures: 0, Errors: 0, Skipped: 0, Time elapsed: 0.097 sec - in org.apache.wiki.VariableManagerTest
Running org.apache.wiki.xmlrpc.RPCHandlerTest
Tests run: 6, Failures: 0, Errors: 0, Skipped: 0, Time elapsed: 2.044 sec - in org.apache.wiki.xmlrpc.RPCHandlerTest

Results :

Failed tests: 
  HtmlStringToWikiTranslatorTest.testCSS:293 expected:<...emand wird sie sehen[%]%, die>
but was:<...emand wird sie sehen[/]%, die>
  HtmlStringToWikiTranslatorTest.testCenter:220 expected:<...; )
Hello \\
World!
[%]%
> but was:<...; )
Hello \\
World!
[/]%
>

Tests run: 959, Failures: 2, Errors: 0, Skipped: 0

[INFO] ------------------------------------------------------------------------
[INFO] Reactor Summary:
[INFO] 
[INFO] Apache JSPWiki .................................... SUCCESS [1.964s]
[INFO] Apache JSPWiki initial wiki pages builder ......... SUCCESS [0.072s]
[INFO] Apache JSPWiki initial wiki pages (de) ............ SUCCESS [2.190s]
[INFO] Apache JSPWiki initial wiki pages (en) ............ SUCCESS [0.357s]
[INFO] Apache JSPWiki initial wiki pages (es) ............ SUCCESS [0.301s]
[INFO] Apache JSPWiki initial wiki pages (fi) ............ SUCCESS [0.242s]
[INFO] Apache JSPWiki initial wiki pages (fr) ............ SUCCESS [0.274s]
[INFO] Apache JSPWiki initial wiki pages (it) ............ SUCCESS [0.296s]
[INFO] Apache JSPWiki initial wiki pages (nl) ............ SUCCESS [0.258s]
[INFO] Apache JSPWiki initial wiki pages (pt_BR) ......... SUCCESS [0.254s]
[INFO] Apache JSPWiki initial wiki pages (ru) ............ SUCCESS [0.285s]
[INFO] Apache JSPWiki initial wiki pages (zh_CN) ......... SUCCESS [0.282s]
[INFO] Apache JSPWiki Main War ........................... FAILURE [1:49.008s]
[INFO] Apache JSPWiki portable ........................... SKIPPED
[INFO] jspwiki-it-builder ................................ SKIPPED
[INFO] jspwiki-selenium-tests ............................ SKIPPED
[INFO] jspwiki-it-test-custom ............................ SKIPPED
[INFO] jspwiki-it-test-custom-absolute-urls .............. SKIPPED
[INFO] jspwiki-it-test-custom-jdbc ....................... SKIPPED
[INFO] jspwiki-it-test-cma ............................... SKIPPED
[INFO] jspwiki-it-test-cma-jdbc .......................... SKIPPED
[INFO] ------------------------------------------------------------------------
[INFO] BUILD FAILURE
[INFO] ------------------------------------------------------------------------
[INFO] Total time: 1:56.587s
[INFO] Finished at: Sun Aug 02 19:23:21 UTC 2015
[INFO] Final Memory: 30M/373M
[INFO] ------------------------------------------------------------------------
[ERROR] Failed to execute goal org.apache.maven.plugins:maven-surefire-plugin:2.18.1:test
(default-test) on project jspwiki-war: There are test failures.
[ERROR] 
[ERROR] Please refer to <https://builds.apache.org/job/JSPWiki/ws/jspwiki-war/target/surefire-reports>
for the individual test results.
[ERROR] -> [Help 1]
[ERROR] 
[ERROR] To see the full stack trace of the errors, re-run Maven with the -e switch.
[ERROR] Re-run Maven using the -X switch to enable full debug logging.
[ERROR] 
[ERROR] For more information about the errors and possible solutions, please read the following
articles:
[ERROR] [Help 1] http://cwiki.apache.org/confluence/display/MAVEN/MojoFailureException
[ERROR] 
[ERROR] After correcting the problems, you can resume the build with the command
[ERROR]   mvn <goals> -rf :jspwiki-war
Build step 'Invoke top-level Maven targets' marked build as failure

Mime
View raw message