jspwiki-commits mailing list archives

Site index · List index
Message view « Date » · « Thread »
Top « Date » · « Thread »
From Apache Jenkins Server <jenk...@builds.apache.org>
Subject Build failed in Jenkins: JSPWiki #327
Date Fri, 30 Jan 2015 08:05:20 GMT
See <https://builds.apache.org/job/JSPWiki/327/changes>

Changes:

[dvittor] JSPWIKI-566: Ajax functionality rewrite.

------------------------------------------
[...truncated 2329 lines...]
Tests run: 2, Failures: 0, Errors: 0, Skipped: 0, Time elapsed: 0.04 sec - in org.apache.wiki.ui.GroupCommandTest
Running org.apache.wiki.ui.RedirectCommandTest
Tests run: 2, Failures: 0, Errors: 0, Skipped: 0, Time elapsed: 0.001 sec - in org.apache.wiki.ui.RedirectCommandTest
Running org.apache.wiki.ui.admin.beans.PluginBeanTest
Tests run: 1, Failures: 0, Errors: 0, Skipped: 0, Time elapsed: 0.031 sec - in org.apache.wiki.ui.admin.beans.PluginBeanTest
Running org.apache.wiki.ui.WikiCommandTest
Tests run: 2, Failures: 0, Errors: 0, Skipped: 0, Time elapsed: 0.043 sec - in org.apache.wiki.ui.WikiCommandTest
Running org.apache.wiki.ui.CommandResolverTest
Tests run: 6, Failures: 0, Errors: 0, Skipped: 0, Time elapsed: 0.214 sec - in org.apache.wiki.ui.CommandResolverTest
Running org.apache.wiki.ui.InputValidatorTest
Tests run: 4, Failures: 0, Errors: 0, Skipped: 0, Time elapsed: 0.058 sec - in org.apache.wiki.ui.InputValidatorTest
Running org.apache.wiki.PageSorterTest
Tests run: 5, Failures: 0, Errors: 0, Skipped: 0, Time elapsed: 0.003 sec - in org.apache.wiki.PageSorterTest
Running org.apache.wiki.parser.JSPWikiMarkupParserTest
Trying to crash parser with a line which is 198002 chars in size
100 page renderings: 0:00:00.197 (507.6142131979695 renderings/second)
Tests run: 206, Failures: 0, Errors: 0, Skipped: 0, Time elapsed: 11.393 sec - in org.apache.wiki.parser.JSPWikiMarkupParserTest
Running org.apache.wiki.parser.MarkupParserTest
Tests run: 3, Failures: 0, Errors: 0, Skipped: 0, Time elapsed: 0 sec - in org.apache.wiki.parser.MarkupParserTest
Running org.apache.wiki.parser.CreoleToJSPWikiTranslatorTest
Tests run: 84, Failures: 0, Errors: 0, Skipped: 0, Time elapsed: 0.145 sec - in org.apache.wiki.parser.CreoleToJSPWikiTranslatorTest
Running org.apache.wiki.htmltowiki.HtmlStringToWikiTranslatorTest
Tests run: 17, Failures: 0, Errors: 0, Skipped: 0, Time elapsed: 0.087 sec - in org.apache.wiki.htmltowiki.HtmlStringToWikiTranslatorTest
Running org.apache.wiki.auth.GroupManagerTest
Tests run: 4, Failures: 0, Errors: 0, Skipped: 0, Time elapsed: 0.054 sec - in org.apache.wiki.auth.GroupManagerTest
Running org.apache.wiki.auth.AuthenticationManagerTest
Tests run: 6, Failures: 0, Errors: 0, Skipped: 0, Time elapsed: 0.127 sec - in org.apache.wiki.auth.AuthenticationManagerTest
Running org.apache.wiki.auth.AuthorizationManagerTest
Tests run: 17, Failures: 0, Errors: 0, Skipped: 0, Time elapsed: 0.34 sec - in org.apache.wiki.auth.AuthorizationManagerTest
Running org.apache.wiki.auth.acl.AclImplTest
Tests run: 6, Failures: 0, Errors: 0, Skipped: 0, Time elapsed: 0.068 sec - in org.apache.wiki.auth.acl.AclImplTest
Running org.apache.wiki.auth.acl.AclEntryImplTest
Tests run: 7, Failures: 0, Errors: 0, Skipped: 0, Time elapsed: 0 sec - in org.apache.wiki.auth.acl.AclEntryImplTest
Running org.apache.wiki.auth.acl.DefaultAclManagerTest
Tests run: 3, Failures: 0, Errors: 0, Skipped: 0, Time elapsed: 0.09 sec - in org.apache.wiki.auth.acl.DefaultAclManagerTest
Running org.apache.wiki.auth.login.UserDatabaseLoginModuleTest
Tests run: 2, Failures: 0, Errors: 0, Skipped: 0, Time elapsed: 0.02 sec - in org.apache.wiki.auth.login.UserDatabaseLoginModuleTest
Running org.apache.wiki.auth.login.CookieAssertionLoginModuleTest
Tests run: 2, Failures: 0, Errors: 0, Skipped: 0, Time elapsed: 0.016 sec - in org.apache.wiki.auth.login.CookieAssertionLoginModuleTest
Running org.apache.wiki.auth.login.AnonymousLoginModuleTest
Tests run: 2, Failures: 0, Errors: 0, Skipped: 0, Time elapsed: 0.016 sec - in org.apache.wiki.auth.login.AnonymousLoginModuleTest
Running org.apache.wiki.auth.login.WebContainerLoginModuleTest
Tests run: 2, Failures: 0, Errors: 0, Skipped: 0, Time elapsed: 0.016 sec - in org.apache.wiki.auth.login.WebContainerLoginModuleTest
Running org.apache.wiki.auth.UserManagerTest
Tests run: 5, Failures: 0, Errors: 0, Skipped: 0, Time elapsed: 0.259 sec - in org.apache.wiki.auth.UserManagerTest
Running org.apache.wiki.auth.user.UserProfileTest
Tests run: 5, Failures: 0, Errors: 0, Skipped: 0, Time elapsed: 0.063 sec - in org.apache.wiki.auth.user.UserProfileTest
Running org.apache.wiki.auth.user.JDBCUserDatabaseTest
[Server@b7f87a]: [Thread[main,5,main]]: setSilent(true)
[Server@62fc80]: [Thread[main,5,main]]: setSilent(true)
[Server@2c18e3]: [Thread[main,5,main]]: setSilent(true)
[Server@11fbbfb]: [Thread[main,5,main]]: setSilent(true)
[Server@1826fcd]: [Thread[main,5,main]]: setSilent(true)
[Server@c7c245]: [Thread[main,5,main]]: setSilent(true)
[Server@347342]: [Thread[main,5,main]]: setSilent(true)
[Server@1f5abf8]: [Thread[main,5,main]]: setSilent(true)
[Server@9bb131]: [Thread[main,5,main]]: setSilent(true)
[Server@164b98c]: [Thread[main,5,main]]: setSilent(true)
[Server@144b48c]: [Thread[main,5,main]]: setSilent(true)
Tests run: 11, Failures: 0, Errors: 0, Skipped: 0, Time elapsed: 24.094 sec - in org.apache.wiki.auth.user.JDBCUserDatabaseTest
Running org.apache.wiki.auth.user.XMLUserDatabaseTest
Tests run: 11, Failures: 0, Errors: 0, Skipped: 0, Time elapsed: 0.184 sec - in org.apache.wiki.auth.user.XMLUserDatabaseTest
Running org.apache.wiki.auth.permissions.AllPermissionTest
Tests run: 5, Failures: 0, Errors: 0, Skipped: 0, Time elapsed: 0 sec - in org.apache.wiki.auth.permissions.AllPermissionTest
Running org.apache.wiki.auth.permissions.WikiPermissionTest
Tests run: 10, Failures: 0, Errors: 0, Skipped: 0, Time elapsed: 0.001 sec - in org.apache.wiki.auth.permissions.WikiPermissionTest
Running org.apache.wiki.auth.permissions.GroupPermissionTest
Tests run: 10, Failures: 0, Errors: 0, Skipped: 0, Time elapsed: 0.003 sec - in org.apache.wiki.auth.permissions.GroupPermissionTest
Running org.apache.wiki.auth.permissions.PagePermissionTest
Tests run: 10, Failures: 0, Errors: 0, Skipped: 0, Time elapsed: 0.002 sec - in org.apache.wiki.auth.permissions.PagePermissionTest
Running org.apache.wiki.auth.permissions.AllPermissionCollectionTest
Tests run: 8, Failures: 0, Errors: 0, Skipped: 0, Time elapsed: 0.004 sec - in org.apache.wiki.auth.permissions.AllPermissionCollectionTest
Running org.apache.wiki.auth.authorize.GroupTest
Tests run: 8, Failures: 0, Errors: 0, Skipped: 0, Time elapsed: 0.062 sec - in org.apache.wiki.auth.authorize.GroupTest
Running org.apache.wiki.auth.authorize.JDBCGroupDatabaseTest
[Server@1896f47]: [Thread[main,5,main]]: setSilent(true)
[Server@1096890]: [Thread[main,5,main]]: setSilent(true)
[Server@360e00]: [Thread[main,5,main]]: setSilent(true)
[Server@11ae1c3]: [Thread[main,5,main]]: setSilent(true)
Tests run: 4, Failures: 0, Errors: 0, Skipped: 0, Time elapsed: 13.766 sec - in org.apache.wiki.auth.authorize.JDBCGroupDatabaseTest
Running org.apache.wiki.auth.authorize.WebContainerAuthorizerTest
Tests run: 4, Failures: 0, Errors: 0, Skipped: 0, Time elapsed: 0.142 sec - in org.apache.wiki.auth.authorize.WebContainerAuthorizerTest
Running org.apache.wiki.auth.authorize.XMLGroupDatabaseTest
Tests run: 4, Failures: 0, Errors: 0, Skipped: 0, Time elapsed: 0.066 sec - in org.apache.wiki.auth.authorize.XMLGroupDatabaseTest
Running org.apache.wiki.xmlrpc.RPCHandlerTest
Tests run: 6, Failures: 0, Errors: 0, Skipped: 0, Time elapsed: 0.538 sec - in org.apache.wiki.xmlrpc.RPCHandlerTest
Running org.apache.wiki.rss.RSSGeneratorTest
Tests run: 2, Failures: 0, Errors: 0, Skipped: 0, Time elapsed: 0.125 sec - in org.apache.wiki.rss.RSSGeneratorTest
Running org.apache.wiki.VariableManagerTest
Tests run: 12, Failures: 0, Errors: 0, Skipped: 0, Time elapsed: 0.099 sec - in org.apache.wiki.VariableManagerTest
Running org.apache.wiki.WikiAjaxServletTest
Tests run: 1, Failures: 0, Errors: 0, Skipped: 0, Time elapsed: 0.032 sec - in org.apache.wiki.WikiAjaxServletTest
Running org.apache.wiki.url.DefaultURLConstructorTest
Tests run: 12, Failures: 0, Errors: 0, Skipped: 0, Time elapsed: 0.099 sec - in org.apache.wiki.url.DefaultURLConstructorTest
Running org.apache.wiki.url.ShortViewURLConstructorTest
Tests run: 12, Failures: 0, Errors: 0, Skipped: 0, Time elapsed: 0.091 sec - in org.apache.wiki.url.ShortViewURLConstructorTest
Running org.apache.wiki.url.ShortURLConstructorTest
Tests run: 12, Failures: 0, Errors: 0, Skipped: 0, Time elapsed: 0.086 sec - in org.apache.wiki.url.ShortURLConstructorTest
Running org.apache.wiki.search.SearchManagerTest
Tests run: 6, Failures: 0, Errors: 0, Skipped: 0, Time elapsed: 10.686 sec - in org.apache.wiki.search.SearchManagerTest
Running org.apache.wiki.providers.CachingProviderTest
Tests run: 2, Failures: 0, Errors: 0, Skipped: 0, Time elapsed: 4.142 sec - in org.apache.wiki.providers.CachingProviderTest
Running org.apache.wiki.providers.VersioningFileProviderTest
Tests run: 20, Failures: 0, Errors: 0, Skipped: 0, Time elapsed: 3.868 sec - in org.apache.wiki.providers.VersioningFileProviderTest
Running org.apache.wiki.providers.BasicAttachmentProviderTest
Tests run: 12, Failures: 0, Errors: 0, Skipped: 0, Time elapsed: 10.408 sec - in org.apache.wiki.providers.BasicAttachmentProviderTest
Running org.apache.wiki.providers.FileSystemProviderTest
Tests run: 10, Failures: 0, Errors: 0, Skipped: 0, Time elapsed: 0.122 sec - in org.apache.wiki.providers.FileSystemProviderTest
Running org.apache.wiki.ReferenceManagerTest
Tests run: 18, Failures: 0, Errors: 0, Skipped: 0, Time elapsed: 1.584 sec - in org.apache.wiki.ReferenceManagerTest
Running org.apache.wiki.content.PageRenamerTest
Tests run: 21, Failures: 0, Errors: 0, Skipped: 0, Time elapsed: 3.734 sec - in org.apache.wiki.content.PageRenamerTest
Running org.apache.wiki.i18n.InternationalizationManagerTest
Tests run: 2, Failures: 0, Errors: 0, Skipped: 0, Time elapsed: 0 sec - in org.apache.wiki.i18n.InternationalizationManagerTest
Running org.apache.wiki.plugin.GroupsTest
Tests run: 1, Failures: 0, Errors: 0, Skipped: 0, Time elapsed: 0.033 sec - in org.apache.wiki.plugin.GroupsTest
Running org.apache.wiki.plugin.ReferringPagesPluginTest
Tests run: 8, Failures: 0, Errors: 0, Skipped: 0, Time elapsed: 0.63 sec - in org.apache.wiki.plugin.ReferringPagesPluginTest
Running org.apache.wiki.plugin.DefaultPluginManagerTest
Tests run: 15, Failures: 0, Errors: 0, Skipped: 0, Time elapsed: 0.186 sec - in org.apache.wiki.plugin.DefaultPluginManagerTest
Running org.apache.wiki.plugin.IfPluginTest
Tests run: 4, Failures: 0, Errors: 0, Skipped: 0, Time elapsed: 0.065 sec - in org.apache.wiki.plugin.IfPluginTest
Running org.apache.wiki.plugin.CounterPluginTest
Tests run: 6, Failures: 0, Errors: 0, Skipped: 0, Time elapsed: 0.051 sec - in org.apache.wiki.plugin.CounterPluginTest
Running org.apache.wiki.plugin.ReferringUndefinedPagesPluginTest
Tests run: 4, Failures: 0, Errors: 0, Skipped: 0, Time elapsed: 0.197 sec - in org.apache.wiki.plugin.ReferringUndefinedPagesPluginTest
Running org.apache.wiki.plugin.InsertPageTest
Tests run: 6, Failures: 0, Errors: 0, Skipped: 0, Time elapsed: 0.118 sec - in org.apache.wiki.plugin.InsertPageTest
Running org.apache.wiki.plugin.PageViewPluginTest
Tests run: 4, Failures: 0, Errors: 0, Skipped: 0, Time elapsed: 0.268 sec - in org.apache.wiki.plugin.PageViewPluginTest
Running org.apache.wiki.plugin.RecentChangesPluginTest
Tests run: 4, Failures: 0, Errors: 0, Skipped: 0, Time elapsed: 0.251 sec - in org.apache.wiki.plugin.RecentChangesPluginTest
Running org.apache.wiki.plugin.TableOfContentsTest
Tests run: 8, Failures: 0, Errors: 0, Skipped: 0, Time elapsed: 0.22 sec - in org.apache.wiki.plugin.TableOfContentsTest
Running org.apache.wiki.plugin.UndefinedPagesPluginTest
Tests run: 2, Failures: 0, Errors: 0, Skipped: 0, Time elapsed: 0.167 sec - in org.apache.wiki.plugin.UndefinedPagesPluginTest
Running org.apache.wiki.ReleaseTest
Tests run: 17, Failures: 0, Errors: 0, Skipped: 0, Time elapsed: 0.003 sec - in org.apache.wiki.ReleaseTest
Running org.apache.wiki.render.WysiwygEditingRendererTest
Tests run: 2, Failures: 0, Errors: 0, Skipped: 0, Time elapsed: 0.052 sec - in org.apache.wiki.render.WysiwygEditingRendererTest
Running org.apache.wiki.render.RenderingManagerTest
Tests run: 1, Failures: 0, Errors: 0, Skipped: 0, Time elapsed: 0.622 sec - in org.apache.wiki.render.RenderingManagerTest
Running org.apache.wiki.render.CreoleRendererTest
Tests run: 14, Failures: 0, Errors: 0, Skipped: 0, Time elapsed: 0.12 sec - in org.apache.wiki.render.CreoleRendererTest
Running org.apache.wiki.PropertyReaderTest
Tests run: 3, Failures: 0, Errors: 0, Skipped: 0, Time elapsed: 0 sec - in org.apache.wiki.PropertyReaderTest
Running org.apache.wiki.attachment.AttachmentManagerTest
Tests run: 14, Failures: 0, Errors: 0, Skipped: 0, Time elapsed: 1.067 sec - in org.apache.wiki.attachment.AttachmentManagerTest
Running org.apache.wiki.WikiEngineTest
MockServletContext: JSPWiki: Unable to load and setup properties from jspwiki.properties.
Failed to start. Caused by: Failed to instantiate class org.apache.wiki.PageManager; please
check log files for better information.
Tests run: 40, Failures: 0, Errors: 1, Skipped: 0, Time elapsed: 2.337 sec <<< FAILURE!
- in org.apache.wiki.WikiEngineTest
testNonExistentDirectory(org.apache.wiki.WikiEngineTest)  Time elapsed: 0.049 sec  <<<
ERROR!
org.apache.wiki.api.exceptions.WikiException: JSPWiki: Unable to load and setup properties
from jspwiki.properties. Failed to start. Caused by: Failed to instantiate class org.apache.wiki.PageManager;
please check log files for better information.
	at org.apache.wiki.providers.AbstractFileProvider.initialize(AbstractFileProvider.java:138)
	at org.apache.wiki.providers.CachingProvider.initialize(CachingProvider.java:146)
	at org.apache.wiki.PageManager.<init>(PageManager.java:190)
	at sun.reflect.GeneratedConstructorAccessor15.newInstance(Unknown Source)
	at sun.reflect.DelegatingConstructorAccessorImpl.newInstance(DelegatingConstructorAccessorImpl.java:27)
	at java.lang.reflect.Constructor.newInstance(Constructor.java:513)
	at org.apache.wiki.util.ClassUtil.getMappedObject(ClassUtil.java:359)
	at org.apache.wiki.WikiEngine.initialize(WikiEngine.java:563)
	at org.apache.wiki.WikiEngine.<init>(WikiEngine.java:430)
	at org.apache.wiki.TestEngine.<init>(TestEngine.java:127)
	at org.apache.wiki.WikiEngineTest.testNonExistentDirectory(WikiEngineTest.java:98)

Running org.apache.wiki.util.TextUtilTest
Tests run: 42, Failures: 0, Errors: 0, Skipped: 0, Time elapsed: 0.03 sec - in org.apache.wiki.util.TextUtilTest
Running org.apache.wiki.util.TimedCounterListTest
Tests run: 2, Failures: 0, Errors: 0, Skipped: 0, Time elapsed: 0.109 sec - in org.apache.wiki.util.TimedCounterListTest
Running org.apache.wiki.util.FileUtilTest
Tests run: 5, Failures: 0, Errors: 0, Skipped: 0, Time elapsed: 0.007 sec - in org.apache.wiki.util.FileUtilTest
Running org.apache.wiki.util.CryptoUtilTest
Tests run: 8, Failures: 0, Errors: 0, Skipped: 0, Time elapsed: 0.002 sec - in org.apache.wiki.util.CryptoUtilTest
Running org.apache.wiki.util.SerializerTest
Tests run: 1, Failures: 0, Errors: 0, Skipped: 0, Time elapsed: 0 sec - in org.apache.wiki.util.SerializerTest
Running org.apache.wiki.util.UtilJ2eeCompatTest
Tests run: 6, Failures: 0, Errors: 0, Skipped: 0, Time elapsed: 0.001 sec - in org.apache.wiki.util.UtilJ2eeCompatTest
Running org.apache.wiki.util.PriorityListTest
Tests run: 4, Failures: 0, Errors: 0, Skipped: 0, Time elapsed: 0 sec - in org.apache.wiki.util.PriorityListTest
Running org.apache.wiki.util.XmlUtilTest
Tests run: 2, Failures: 0, Errors: 0, Skipped: 0, Time elapsed: 0.009 sec - in org.apache.wiki.util.XmlUtilTest
Running org.apache.wiki.util.ByteUtilsTest
Tests run: 3, Failures: 0, Errors: 0, Skipped: 0, Time elapsed: 0.001 sec - in org.apache.wiki.util.ByteUtilsTest
Running org.apache.wiki.util.PropertyReaderTest
Tests run: 1, Failures: 0, Errors: 0, Skipped: 0, Time elapsed: 0.001 sec - in org.apache.wiki.util.PropertyReaderTest
Running org.apache.wiki.util.comparators.HumanComparatorTest
Tests run: 2, Failures: 0, Errors: 0, Skipped: 0, Time elapsed: 0.001 sec - in org.apache.wiki.util.comparators.HumanComparatorTest
Running org.apache.wiki.util.CommentedPropertiesTest
Tests run: 4, Failures: 0, Errors: 0, Skipped: 0, Time elapsed: 0.003 sec - in org.apache.wiki.util.CommentedPropertiesTest
Running org.apache.wiki.util.MailUtilTest
I could not test whether mail sending works, since I could not connect to your SMTP server.
Reason: Could not connect to SMTP host: 127.0.0.1, port: 25
Tests run: 2, Failures: 0, Errors: 0, Skipped: 0, Time elapsed: 0.027 sec - in org.apache.wiki.util.MailUtilTest
Running org.apache.wiki.util.ClassUtilTest
Tests run: 3, Failures: 0, Errors: 0, Skipped: 0, Time elapsed: 0.077 sec - in org.apache.wiki.util.ClassUtilTest
Running org.apache.wiki.filters.DefaultFilterManagerTest
Tests run: 2, Failures: 0, Errors: 0, Skipped: 0, Time elapsed: 0.023 sec - in org.apache.wiki.filters.DefaultFilterManagerTest

Results :

Tests in error: 
  WikiEngineTest.testNonExistentDirectory:98 ? Wiki JSPWiki: Unable to load and ...

Tests run: 958, Failures: 0, Errors: 1, Skipped: 0

[INFO] ------------------------------------------------------------------------
[INFO] Reactor Summary:
[INFO] 
[INFO] Apache JSPWiki .................................... SUCCESS [3.486s]
[INFO] Apache JSPWiki initial wiki pages builder ......... SUCCESS [0.057s]
[INFO] Apache JSPWiki initial wiki pages (de) ............ SUCCESS [1.629s]
[INFO] Apache JSPWiki initial wiki pages (en) ............ SUCCESS [0.252s]
[INFO] Apache JSPWiki initial wiki pages (es) ............ SUCCESS [0.284s]
[INFO] Apache JSPWiki initial wiki pages (fi) ............ SUCCESS [0.186s]
[INFO] Apache JSPWiki initial wiki pages (fr) ............ SUCCESS [0.276s]
[INFO] Apache JSPWiki initial wiki pages (it) ............ SUCCESS [0.405s]
[INFO] Apache JSPWiki initial wiki pages (nl) ............ SUCCESS [0.280s]
[INFO] Apache JSPWiki initial wiki pages (pt_BR) ......... SUCCESS [0.269s]
[INFO] Apache JSPWiki initial wiki pages (zh_CN) ......... SUCCESS [0.328s]
[INFO] Apache JSPWiki Main War ........................... FAILURE [1:50.393s]
[INFO] Apache JSPWiki portable ........................... SKIPPED
[INFO] jspwiki-it-builder ................................ SKIPPED
[INFO] jspwiki-selenium-tests ............................ SKIPPED
[INFO] jspwiki-it-test-custom ............................ SKIPPED
[INFO] jspwiki-it-test-custom-absolute-urls .............. SKIPPED
[INFO] jspwiki-it-test-custom-jdbc ....................... SKIPPED
[INFO] jspwiki-it-test-cma ............................... SKIPPED
[INFO] jspwiki-it-test-cma-jdbc .......................... SKIPPED
[INFO] ------------------------------------------------------------------------
[INFO] BUILD FAILURE
[INFO] ------------------------------------------------------------------------
[INFO] Total time: 1:58.469s
[INFO] Finished at: Fri Jan 30 08:05:19 UTC 2015
[INFO] Final Memory: 32M/327M
[INFO] ------------------------------------------------------------------------
[ERROR] Failed to execute goal org.apache.maven.plugins:maven-surefire-plugin:2.17:test (default-test)
on project jspwiki-war: There are test failures.
[ERROR] 
[ERROR] Please refer to /x1/jenkins/jenkins-slave/workspace/JSPWiki/jspwiki-war/target/surefire-reports
for the individual test results.
[ERROR] -> [Help 1]
[ERROR] 
[ERROR] To see the full stack trace of the errors, re-run Maven with the -e switch.
[ERROR] Re-run Maven using the -X switch to enable full debug logging.
[ERROR] 
[ERROR] For more information about the errors and possible solutions, please read the following
articles:
[ERROR] [Help 1] http://cwiki.apache.org/confluence/display/MAVEN/MojoFailureException
[ERROR] 
[ERROR] After correcting the problems, you can resume the build with the command
[ERROR]   mvn <goals> -rf :jspwiki-war
Build step 'Invoke top-level Maven targets' marked build as failure

Mime
View raw message