jspwiki-commits mailing list archives

Site index · List index
Message view « Date » · « Thread »
Top « Date » · « Thread »
From Apache Jenkins Server <jenk...@builds.apache.org>
Subject Build failed in Jenkins: JSPWiki #303
Date Sun, 22 Jun 2014 19:06:18 GMT
See <https://builds.apache.org/job/JSPWiki/303/changes>

Changes:

[juanpablo] * 2.10.2-svn-3

 * Fixed JSPWIKI-847 - Recent Changes Plugin breaks markup if generates an empty table, reported
by Dave Koelmeyer

------------------------------------------
[...truncated 3612 lines...]
	at org.apache.wiki.util.ClassUtil.getMappedObject(ClassUtil.java:359)
	at org.apache.wiki.WikiEngine.initialize(WikiEngine.java:563)
	at org.apache.wiki.WikiEngine.<init>(WikiEngine.java:430)
	at org.apache.wiki.TestEngine.<init>(TestEngine.java:127)
	at org.apache.wiki.providers.FileSystemProviderTest.setUp(FileSystemProviderTest.java:60)

testSlashesInPageNamesUTF8(org.apache.wiki.providers.FileSystemProviderTest)  Time elapsed:
0.002 sec  <<< ERROR!
org.apache.wiki.api.exceptions.WikiException: JSPWiki: Unable to load and setup properties
from jspwiki.properties. Failed to start; please check log files for better information.
	at org.apache.wiki.providers.AbstractFileProvider.initialize(AbstractFileProvider.java:110)
	at org.apache.wiki.providers.CachingProvider.initialize(CachingProvider.java:146)
	at org.apache.wiki.PageManager.<init>(PageManager.java:190)
	at sun.reflect.GeneratedConstructorAccessor12.newInstance(Unknown Source)
	at sun.reflect.DelegatingConstructorAccessorImpl.newInstance(DelegatingConstructorAccessorImpl.java:27)
	at java.lang.reflect.Constructor.newInstance(Constructor.java:513)
	at org.apache.wiki.util.ClassUtil.getMappedObject(ClassUtil.java:359)
	at org.apache.wiki.WikiEngine.initialize(WikiEngine.java:563)
	at org.apache.wiki.WikiEngine.<init>(WikiEngine.java:430)
	at org.apache.wiki.TestEngine.<init>(TestEngine.java:127)
	at org.apache.wiki.providers.FileSystemProviderTest.setUp(FileSystemProviderTest.java:60)

testDotsInBeginning(org.apache.wiki.providers.FileSystemProviderTest)  Time elapsed: 0.003
sec  <<< ERROR!
org.apache.wiki.api.exceptions.WikiException: JSPWiki: Unable to load and setup properties
from jspwiki.properties. Failed to start; please check log files for better information.
	at org.apache.wiki.providers.AbstractFileProvider.initialize(AbstractFileProvider.java:110)
	at org.apache.wiki.providers.CachingProvider.initialize(CachingProvider.java:146)
	at org.apache.wiki.PageManager.<init>(PageManager.java:190)
	at sun.reflect.GeneratedConstructorAccessor12.newInstance(Unknown Source)
	at sun.reflect.DelegatingConstructorAccessorImpl.newInstance(DelegatingConstructorAccessorImpl.java:27)
	at java.lang.reflect.Constructor.newInstance(Constructor.java:513)
	at org.apache.wiki.util.ClassUtil.getMappedObject(ClassUtil.java:359)
	at org.apache.wiki.WikiEngine.initialize(WikiEngine.java:563)
	at org.apache.wiki.WikiEngine.<init>(WikiEngine.java:430)
	at org.apache.wiki.TestEngine.<init>(TestEngine.java:127)
	at org.apache.wiki.providers.FileSystemProviderTest.setUp(FileSystemProviderTest.java:60)

testSlashesInPageNames(org.apache.wiki.providers.FileSystemProviderTest)  Time elapsed: 0.002
sec  <<< ERROR!
org.apache.wiki.api.exceptions.WikiException: JSPWiki: Unable to load and setup properties
from jspwiki.properties. Failed to start; please check log files for better information.
	at org.apache.wiki.providers.AbstractFileProvider.initialize(AbstractFileProvider.java:110)
	at org.apache.wiki.providers.CachingProvider.initialize(CachingProvider.java:146)
	at org.apache.wiki.PageManager.<init>(PageManager.java:190)
	at sun.reflect.GeneratedConstructorAccessor12.newInstance(Unknown Source)
	at sun.reflect.DelegatingConstructorAccessorImpl.newInstance(DelegatingConstructorAccessorImpl.java:27)
	at java.lang.reflect.Constructor.newInstance(Constructor.java:513)
	at org.apache.wiki.util.ClassUtil.getMappedObject(ClassUtil.java:359)
	at org.apache.wiki.WikiEngine.initialize(WikiEngine.java:563)
	at org.apache.wiki.WikiEngine.<init>(WikiEngine.java:430)
	at org.apache.wiki.TestEngine.<init>(TestEngine.java:127)
	at org.apache.wiki.providers.FileSystemProviderTest.setUp(FileSystemProviderTest.java:60)

testAuthor(org.apache.wiki.providers.FileSystemProviderTest)  Time elapsed: 0.002 sec  <<<
ERROR!
org.apache.wiki.api.exceptions.WikiException: JSPWiki: Unable to load and setup properties
from jspwiki.properties. Failed to start; please check log files for better information.
	at org.apache.wiki.providers.AbstractFileProvider.initialize(AbstractFileProvider.java:110)
	at org.apache.wiki.providers.CachingProvider.initialize(CachingProvider.java:146)
	at org.apache.wiki.PageManager.<init>(PageManager.java:190)
	at sun.reflect.GeneratedConstructorAccessor12.newInstance(Unknown Source)
	at sun.reflect.DelegatingConstructorAccessorImpl.newInstance(DelegatingConstructorAccessorImpl.java:27)
	at java.lang.reflect.Constructor.newInstance(Constructor.java:513)
	at org.apache.wiki.util.ClassUtil.getMappedObject(ClassUtil.java:359)
	at org.apache.wiki.WikiEngine.initialize(WikiEngine.java:563)
	at org.apache.wiki.WikiEngine.<init>(WikiEngine.java:430)
	at org.apache.wiki.TestEngine.<init>(TestEngine.java:127)
	at org.apache.wiki.providers.FileSystemProviderTest.setUp(FileSystemProviderTest.java:60)

testDirectoryIsFile(org.apache.wiki.providers.FileSystemProviderTest)  Time elapsed: 0.002
sec  <<< ERROR!
org.apache.wiki.api.exceptions.WikiException: JSPWiki: Unable to load and setup properties
from jspwiki.properties. Failed to start; please check log files for better information.
	at org.apache.wiki.providers.AbstractFileProvider.initialize(AbstractFileProvider.java:110)
	at org.apache.wiki.providers.CachingProvider.initialize(CachingProvider.java:146)
	at org.apache.wiki.PageManager.<init>(PageManager.java:190)
	at sun.reflect.GeneratedConstructorAccessor12.newInstance(Unknown Source)
	at sun.reflect.DelegatingConstructorAccessorImpl.newInstance(DelegatingConstructorAccessorImpl.java:27)
	at java.lang.reflect.Constructor.newInstance(Constructor.java:513)
	at org.apache.wiki.util.ClassUtil.getMappedObject(ClassUtil.java:359)
	at org.apache.wiki.WikiEngine.initialize(WikiEngine.java:563)
	at org.apache.wiki.WikiEngine.<init>(WikiEngine.java:430)
	at org.apache.wiki.TestEngine.<init>(TestEngine.java:127)
	at org.apache.wiki.providers.FileSystemProviderTest.setUp(FileSystemProviderTest.java:60)

testDelete(org.apache.wiki.providers.FileSystemProviderTest)  Time elapsed: 0.003 sec  <<<
ERROR!
org.apache.wiki.api.exceptions.WikiException: JSPWiki: Unable to load and setup properties
from jspwiki.properties. Failed to start; please check log files for better information.
	at org.apache.wiki.providers.AbstractFileProvider.initialize(AbstractFileProvider.java:110)
	at org.apache.wiki.providers.CachingProvider.initialize(CachingProvider.java:146)
	at org.apache.wiki.PageManager.<init>(PageManager.java:190)
	at sun.reflect.GeneratedConstructorAccessor12.newInstance(Unknown Source)
	at sun.reflect.DelegatingConstructorAccessorImpl.newInstance(DelegatingConstructorAccessorImpl.java:27)
	at java.lang.reflect.Constructor.newInstance(Constructor.java:513)
	at org.apache.wiki.util.ClassUtil.getMappedObject(ClassUtil.java:359)
	at org.apache.wiki.WikiEngine.initialize(WikiEngine.java:563)
	at org.apache.wiki.WikiEngine.<init>(WikiEngine.java:430)
	at org.apache.wiki.TestEngine.<init>(TestEngine.java:127)
	at org.apache.wiki.providers.FileSystemProviderTest.setUp(FileSystemProviderTest.java:60)

Running org.apache.wiki.ReferenceManagerTest
Tests run: 18, Failures: 0, Errors: 0, Skipped: 0, Time elapsed: 0.907 sec - in org.apache.wiki.ReferenceManagerTest
Running org.apache.wiki.content.PageRenamerTest
Tests run: 21, Failures: 0, Errors: 0, Skipped: 0, Time elapsed: 1.544 sec - in org.apache.wiki.content.PageRenamerTest
Running org.apache.wiki.i18n.InternationalizationManagerTest
Tests run: 2, Failures: 0, Errors: 0, Skipped: 0, Time elapsed: 0 sec - in org.apache.wiki.i18n.InternationalizationManagerTest
Running org.apache.wiki.plugin.GroupsTest
Tests run: 1, Failures: 0, Errors: 0, Skipped: 0, Time elapsed: 0.033 sec - in org.apache.wiki.plugin.GroupsTest
Running org.apache.wiki.plugin.ReferringPagesPluginTest
Tests run: 8, Failures: 0, Errors: 0, Skipped: 0, Time elapsed: 0.564 sec - in org.apache.wiki.plugin.ReferringPagesPluginTest
Running org.apache.wiki.plugin.DefaultPluginManagerTest
Tests run: 15, Failures: 0, Errors: 0, Skipped: 0, Time elapsed: 0.224 sec - in org.apache.wiki.plugin.DefaultPluginManagerTest
Running org.apache.wiki.plugin.IfPluginTest
Tests run: 4, Failures: 0, Errors: 0, Skipped: 0, Time elapsed: 0.067 sec - in org.apache.wiki.plugin.IfPluginTest
Running org.apache.wiki.plugin.CounterPluginTest
Tests run: 6, Failures: 0, Errors: 0, Skipped: 0, Time elapsed: 0.055 sec - in org.apache.wiki.plugin.CounterPluginTest
Running org.apache.wiki.plugin.ReferringUndefinedPagesPluginTest
Tests run: 4, Failures: 0, Errors: 0, Skipped: 0, Time elapsed: 0.124 sec - in org.apache.wiki.plugin.ReferringUndefinedPagesPluginTest
Running org.apache.wiki.plugin.InsertPageTest
Tests run: 6, Failures: 0, Errors: 0, Skipped: 0, Time elapsed: 0.12 sec - in org.apache.wiki.plugin.InsertPageTest
Running org.apache.wiki.plugin.PageViewPluginTest
Tests run: 4, Failures: 0, Errors: 0, Skipped: 0, Time elapsed: 0.182 sec - in org.apache.wiki.plugin.PageViewPluginTest
Running org.apache.wiki.plugin.RecentChangesPluginTest
Tests run: 4, Failures: 1, Errors: 0, Skipped: 0, Time elapsed: 0.179 sec <<< FAILURE!
- in org.apache.wiki.plugin.RecentChangesPluginTest
testNoRecentChanges(org.apache.wiki.plugin.RecentChangesPluginTest)  Time elapsed: 0.055 sec
 <<< FAILURE!
junit.framework.ComparisonFailure: expected:<...ges" cellpadding="4"[ /]>> but was:<...ges"
cellpadding="4"[></table]>>
	at junit.framework.Assert.assertEquals(Assert.java:100)
	at junit.framework.Assert.assertEquals(Assert.java:107)
	at junit.framework.TestCase.assertEquals(TestCase.java:269)
	at org.apache.wiki.plugin.RecentChangesPluginTest.testNoRecentChanges(RecentChangesPluginTest.java:128)

Running org.apache.wiki.plugin.TableOfContentsTest
Tests run: 8, Failures: 0, Errors: 0, Skipped: 0, Time elapsed: 0.233 sec - in org.apache.wiki.plugin.TableOfContentsTest
Running org.apache.wiki.plugin.UndefinedPagesPluginTest
Tests run: 2, Failures: 0, Errors: 0, Skipped: 0, Time elapsed: 0.071 sec - in org.apache.wiki.plugin.UndefinedPagesPluginTest
Running org.apache.wiki.ReleaseTest
Tests run: 17, Failures: 0, Errors: 0, Skipped: 0, Time elapsed: 0.003 sec - in org.apache.wiki.ReleaseTest
Running org.apache.wiki.render.WysiwygEditingRendererTest
Tests run: 2, Failures: 0, Errors: 0, Skipped: 0, Time elapsed: 0.045 sec - in org.apache.wiki.render.WysiwygEditingRendererTest
Running org.apache.wiki.render.RenderingManagerTest
Tests run: 1, Failures: 0, Errors: 0, Skipped: 0, Time elapsed: 0.589 sec - in org.apache.wiki.render.RenderingManagerTest
Running org.apache.wiki.render.CreoleRendererTest
Tests run: 14, Failures: 0, Errors: 0, Skipped: 0, Time elapsed: 0.116 sec - in org.apache.wiki.render.CreoleRendererTest
Running org.apache.wiki.PropertyReaderTest
Tests run: 3, Failures: 0, Errors: 0, Skipped: 0, Time elapsed: 0 sec - in org.apache.wiki.PropertyReaderTest
Running org.apache.wiki.attachment.AttachmentManagerTest
Tests run: 14, Failures: 0, Errors: 0, Skipped: 0, Time elapsed: 0.619 sec - in org.apache.wiki.attachment.AttachmentManagerTest
Running org.apache.wiki.WikiEngineTest
MockServletContext: JSPWiki: Unable to load and setup properties from jspwiki.properties.
Failed to start; please check log files for better information.
Tests run: 40, Failures: 0, Errors: 1, Skipped: 0, Time elapsed: 1.381 sec <<< FAILURE!
- in org.apache.wiki.WikiEngineTest
testNonExistentDirectory(org.apache.wiki.WikiEngineTest)  Time elapsed: 0.016 sec  <<<
ERROR!
org.apache.wiki.api.exceptions.WikiException: JSPWiki: Unable to load and setup properties
from jspwiki.properties. Failed to start; please check log files for better information.
	at org.apache.wiki.providers.AbstractFileProvider.initialize(AbstractFileProvider.java:110)
	at org.apache.wiki.providers.CachingProvider.initialize(CachingProvider.java:146)
	at org.apache.wiki.PageManager.<init>(PageManager.java:190)
	at sun.reflect.GeneratedConstructorAccessor12.newInstance(Unknown Source)
	at sun.reflect.DelegatingConstructorAccessorImpl.newInstance(DelegatingConstructorAccessorImpl.java:27)
	at java.lang.reflect.Constructor.newInstance(Constructor.java:513)
	at org.apache.wiki.util.ClassUtil.getMappedObject(ClassUtil.java:359)
	at org.apache.wiki.WikiEngine.initialize(WikiEngine.java:563)
	at org.apache.wiki.WikiEngine.<init>(WikiEngine.java:430)
	at org.apache.wiki.TestEngine.<init>(TestEngine.java:127)
	at org.apache.wiki.WikiEngineTest.testNonExistentDirectory(WikiEngineTest.java:98)

Running org.apache.wiki.util.TextUtilTest
Tests run: 42, Failures: 0, Errors: 0, Skipped: 0, Time elapsed: 0.056 sec - in org.apache.wiki.util.TextUtilTest
Running org.apache.wiki.util.TimedCounterListTest
Tests run: 2, Failures: 0, Errors: 0, Skipped: 0, Time elapsed: 0.11 sec - in org.apache.wiki.util.TimedCounterListTest
Running org.apache.wiki.util.FileUtilTest
Tests run: 5, Failures: 0, Errors: 0, Skipped: 0, Time elapsed: 0.011 sec - in org.apache.wiki.util.FileUtilTest
Running org.apache.wiki.util.CryptoUtilTest
Tests run: 8, Failures: 0, Errors: 0, Skipped: 0, Time elapsed: 0.002 sec - in org.apache.wiki.util.CryptoUtilTest
Running org.apache.wiki.util.SerializerTest
Tests run: 1, Failures: 0, Errors: 0, Skipped: 0, Time elapsed: 0 sec - in org.apache.wiki.util.SerializerTest
Running org.apache.wiki.util.UtilJ2eeCompatTest
Tests run: 4, Failures: 0, Errors: 0, Skipped: 0, Time elapsed: 0.001 sec - in org.apache.wiki.util.UtilJ2eeCompatTest
Running org.apache.wiki.util.PriorityListTest
Tests run: 4, Failures: 0, Errors: 0, Skipped: 0, Time elapsed: 0.001 sec - in org.apache.wiki.util.PriorityListTest
Running org.apache.wiki.util.XmlUtilTest
Tests run: 2, Failures: 0, Errors: 0, Skipped: 0, Time elapsed: 0.011 sec - in org.apache.wiki.util.XmlUtilTest
Running org.apache.wiki.util.ByteUtilsTest
Tests run: 3, Failures: 0, Errors: 0, Skipped: 0, Time elapsed: 0 sec - in org.apache.wiki.util.ByteUtilsTest
Running org.apache.wiki.util.PropertyReaderTest
Tests run: 1, Failures: 0, Errors: 0, Skipped: 0, Time elapsed: 0.001 sec - in org.apache.wiki.util.PropertyReaderTest
Running org.apache.wiki.util.comparators.HumanComparatorTest
Tests run: 2, Failures: 0, Errors: 0, Skipped: 0, Time elapsed: 0 sec - in org.apache.wiki.util.comparators.HumanComparatorTest
Running org.apache.wiki.util.CommentedPropertiesTest
Tests run: 4, Failures: 0, Errors: 0, Skipped: 0, Time elapsed: 0.053 sec - in org.apache.wiki.util.CommentedPropertiesTest
Running org.apache.wiki.util.MailUtilTest
I could not test whether mail sending works, since I could not connect to your SMTP server.
Reason: Could not connect to SMTP host: 127.0.0.1, port: 25
Tests run: 2, Failures: 0, Errors: 0, Skipped: 0, Time elapsed: 0.029 sec - in org.apache.wiki.util.MailUtilTest
Running org.apache.wiki.util.ClassUtilTest
Tests run: 3, Failures: 0, Errors: 0, Skipped: 0, Time elapsed: 0.089 sec - in org.apache.wiki.util.ClassUtilTest
Running org.apache.wiki.filters.DefaultFilterManagerTest
Tests run: 2, Failures: 0, Errors: 0, Skipped: 0, Time elapsed: 0.03 sec - in org.apache.wiki.filters.DefaultFilterManagerTest

Results :

Failed tests: 
  RecentChangesPluginTest.testNoRecentChanges:128 expected:<...ges" cellpadding="4"[ /]>>
but was:<...ges" cellpadding="4"[></table]>>

Tests in error: 
  FileSystemProviderTest.setUp:60 ? Wiki JSPWiki: Unable to load and setup prope...
  FileSystemProviderTest.setUp:60 ? Wiki JSPWiki: Unable to load and setup prope...
  FileSystemProviderTest.setUp:60 ? Wiki JSPWiki: Unable to load and setup prope...
  FileSystemProviderTest.setUp:60 ? Wiki JSPWiki: Unable to load and setup prope...
  FileSystemProviderTest.setUp:60 ? Wiki JSPWiki: Unable to load and setup prope...
  FileSystemProviderTest.setUp:60 ? Wiki JSPWiki: Unable to load and setup prope...
  FileSystemProviderTest.setUp:60 ? Wiki JSPWiki: Unable to load and setup prope...
  FileSystemProviderTest.setUp:60 ? Wiki JSPWiki: Unable to load and setup prope...
  FileSystemProviderTest.setUp:60 ? Wiki JSPWiki: Unable to load and setup prope...
  WikiEngineTest.testNonExistentDirectory:98 ? Wiki JSPWiki: Unable to load and ...

Tests run: 954, Failures: 1, Errors: 10, Skipped: 0

[INFO] ------------------------------------------------------------------------
[INFO] Reactor Summary:
[INFO] 
[INFO] Apache JSPWiki .................................... SUCCESS [1.680s]
[INFO] Apache JSPWiki initial wiki pages builder ......... SUCCESS [0.030s]
[INFO] Apache JSPWiki initial wiki pages (de) ............ SUCCESS [1.043s]
[INFO] Apache JSPWiki initial wiki pages (en) ............ SUCCESS [0.248s]
[INFO] Apache JSPWiki initial wiki pages (es) ............ SUCCESS [0.270s]
[INFO] Apache JSPWiki initial wiki pages (fi) ............ SUCCESS [0.174s]
[INFO] Apache JSPWiki initial wiki pages (fr) ............ SUCCESS [0.275s]
[INFO] Apache JSPWiki initial wiki pages (it) ............ SUCCESS [0.252s]
[INFO] Apache JSPWiki initial wiki pages (nl) ............ SUCCESS [0.239s]
[INFO] Apache JSPWiki initial wiki pages (pt_BR) ......... SUCCESS [0.245s]
[INFO] Apache JSPWiki initial wiki pages (zh_CN) ......... SUCCESS [0.243s]
[INFO] Apache JSPWiki Main War ........................... FAILURE [1:42.454s]
[INFO] jspwiki-it-builder ................................ SKIPPED
[INFO] jspwiki-selenium-tests ............................ SKIPPED
[INFO] jspwiki-it-test-custom ............................ SKIPPED
[INFO] jspwiki-it-test-custom-absolute-urls .............. SKIPPED
[INFO] jspwiki-it-test-custom-jdbc ....................... SKIPPED
[INFO] jspwiki-it-test-cma ............................... SKIPPED
[INFO] jspwiki-it-test-cma-jdbc .......................... SKIPPED
[INFO] ------------------------------------------------------------------------
[INFO] BUILD FAILURE
[INFO] ------------------------------------------------------------------------
[INFO] Total time: 1:47.723s
[INFO] Finished at: Sun Jun 22 19:06:17 UTC 2014
[INFO] Final Memory: 32M/374M
[INFO] ------------------------------------------------------------------------
[ERROR] Failed to execute goal org.apache.maven.plugins:maven-surefire-plugin:2.16:test (default-test)
on project jspwiki-war: There are test failures.
[ERROR] 
[ERROR] Please refer to /x1/jenkins/jenkins-slave/workspace/JSPWiki/jspwiki-war/target/surefire-reports
for the individual test results.
[ERROR] -> [Help 1]
[ERROR] 
[ERROR] To see the full stack trace of the errors, re-run Maven with the -e switch.
[ERROR] Re-run Maven using the -X switch to enable full debug logging.
[ERROR] 
[ERROR] For more information about the errors and possible solutions, please read the following
articles:
[ERROR] [Help 1] http://cwiki.apache.org/confluence/display/MAVEN/MojoFailureException
[ERROR] 
[ERROR] After correcting the problems, you can resume the build with the command
[ERROR]   mvn <goals> -rf :jspwiki-war
Build step 'Invoke top-level Maven targets' marked build as failure

Mime
View raw message