jspwiki-commits mailing list archives

Site index · List index
Message view « Date » · « Thread »
Top « Date » · « Thread »
From Apache Jenkins Server <jenk...@builds.apache.org>
Subject Build failed in Jenkins: JSPWiki #266
Date Thu, 02 Jan 2014 21:02:58 GMT
See <https://builds.apache.org/job/JSPWiki/266/changes>

Changes:

[juanpablo] * 2.10.0-svn-65
       
 * JSPWIKI-731: replaced all http://www.jspwiki.org references with http://jspwiki.apache.org

[juanpablo] JSPWIKI-731: removing jspwiki.org references, interwiki references for Doc: and
JSPWiki: now pointing to jspwiki-wiki.a.o

[juanpablo] replaced all NewIn2.8 / NewIn2.6 references with NewIn (to serve as a placeholder
for all NewInX.YY pages)

[juanpablo] replaced non-existent http://www.jspwiki.org/wiki/JanneJalkanen references with
http://www.ecyrd.com/JSPWiki/wiki/JanneJalkanen

[juanpablo] JSPWIKI-731: replaced http://www.jspwiki.org/wiki/ with JSPWiki interwiki reference

[juanpablo] JSPWIKI-731: replaced http://doc.jspwiki.org/2.8/wiki/ with Doc interwiki reference

[juanpablo] removed incubator reference

[juanpablo] switching from ISO-8859-1 to UTF-8

all wikipages on utf-8 now

[juanpablo] switching from ISO-8859-1 to UTF-8

[juanpablo] JSPWIKI-731: http://www.jspwiki.org/ reference in 6 files (second wave)

also got rid of pending incubator references

deleted reference to jspwiki dev blog (blog.jspwiki.org), as it is no longer active

------------------------------------------
[...truncated 329 lines...]

testHyperlinksInterWiki2(org.apache.wiki.parser.JSPWikiMarkupParserTest)  Time elapsed: 0.013
sec  <<< FAILURE!
junit.framework.ComparisonFailure: expected:<...rwiki" href="http://[www.ecyrd.com/JSPWiki]/Wiki.jsp?page=Hyper...>
but was:<...rwiki" href="http://[jspwiki-wiki.apache.org]/Wiki.jsp?page=Hyper...>
	at junit.framework.Assert.assertEquals(Assert.java:100)
	at junit.framework.Assert.assertEquals(Assert.java:107)
	at junit.framework.TestCase.assertEquals(TestCase.java:269)
	at org.apache.wiki.parser.JSPWikiMarkupParserTest.testHyperlinksInterWiki2(JSPWikiMarkupParserTest.java:670)

Running org.apache.wiki.diff.ContextualDiffProviderTest
Tests run: 6, Failures: 0, Errors: 0, Skipped: 0, Time elapsed: 0.388 sec - in org.apache.wiki.diff.ContextualDiffProviderTest
Running org.apache.wiki.url.ShortViewURLConstructorTest
Tests run: 12, Failures: 0, Errors: 0, Skipped: 0, Time elapsed: 0.133 sec - in org.apache.wiki.url.ShortViewURLConstructorTest
Running org.apache.wiki.url.ShortURLConstructorTest
Tests run: 12, Failures: 0, Errors: 0, Skipped: 0, Time elapsed: 0.169 sec - in org.apache.wiki.url.ShortURLConstructorTest
Running org.apache.wiki.url.DefaultURLConstructorTest
Tests run: 12, Failures: 0, Errors: 0, Skipped: 0, Time elapsed: 0.131 sec - in org.apache.wiki.url.DefaultURLConstructorTest
Running org.apache.wiki.ReleaseTest
Tests run: 17, Failures: 0, Errors: 0, Skipped: 0, Time elapsed: 0.002 sec - in org.apache.wiki.ReleaseTest
Running org.apache.wiki.content.PageRenamerTest
Tests run: 21, Failures: 0, Errors: 0, Skipped: 0, Time elapsed: 0.482 sec - in org.apache.wiki.content.PageRenamerTest
Running org.apache.wiki.PageManagerTest
Tests run: 2, Failures: 0, Errors: 0, Skipped: 0, Time elapsed: 0.023 sec - in org.apache.wiki.PageManagerTest
Running org.apache.wiki.htmltowiki.HtmlStringToWikiTranslatorTest
Tests run: 17, Failures: 0, Errors: 0, Skipped: 0, Time elapsed: 0.123 sec - in org.apache.wiki.htmltowiki.HtmlStringToWikiTranslatorTest
Running org.apache.wiki.plugin.CounterPluginTest
Tests run: 6, Failures: 0, Errors: 0, Skipped: 0, Time elapsed: 0.074 sec - in org.apache.wiki.plugin.CounterPluginTest
Running org.apache.wiki.plugin.DefaultPluginManagerTest
Tests run: 15, Failures: 0, Errors: 0, Skipped: 0, Time elapsed: 0.194 sec - in org.apache.wiki.plugin.DefaultPluginManagerTest
Running org.apache.wiki.plugin.GroupsTest
Tests run: 1, Failures: 0, Errors: 0, Skipped: 0, Time elapsed: 0.005 sec - in org.apache.wiki.plugin.GroupsTest
Running org.apache.wiki.plugin.ReferringPagesPluginTest
Tests run: 8, Failures: 0, Errors: 0, Skipped: 0, Time elapsed: 0.786 sec - in org.apache.wiki.plugin.ReferringPagesPluginTest
Running org.apache.wiki.plugin.IfPluginTest
Tests run: 4, Failures: 0, Errors: 0, Skipped: 0, Time elapsed: 0.065 sec - in org.apache.wiki.plugin.IfPluginTest
Running org.apache.wiki.plugin.PageViewPluginTest
Tests run: 4, Failures: 0, Errors: 0, Skipped: 0, Time elapsed: 0.106 sec - in org.apache.wiki.plugin.PageViewPluginTest
Running org.apache.wiki.plugin.TableOfContentsTest
Tests run: 8, Failures: 0, Errors: 0, Skipped: 0, Time elapsed: 0.142 sec - in org.apache.wiki.plugin.TableOfContentsTest
Running org.apache.wiki.plugin.InsertPageTest
Tests run: 6, Failures: 0, Errors: 0, Skipped: 0, Time elapsed: 0.118 sec - in org.apache.wiki.plugin.InsertPageTest
Running org.apache.wiki.plugin.UndefinedPagesPluginTest
Tests run: 2, Failures: 0, Errors: 0, Skipped: 0, Time elapsed: 0.262 sec - in org.apache.wiki.plugin.UndefinedPagesPluginTest
Running org.apache.wiki.plugin.RecentChangesPluginTest
Tests run: 3, Failures: 0, Errors: 0, Skipped: 0, Time elapsed: 0.077 sec - in org.apache.wiki.plugin.RecentChangesPluginTest
Running org.apache.wiki.ReferenceManagerTest
Tests run: 18, Failures: 0, Errors: 0, Skipped: 0, Time elapsed: 0.337 sec - in org.apache.wiki.ReferenceManagerTest
Running org.apache.wiki.auth.authorize.GroupTest
Tests run: 8, Failures: 0, Errors: 0, Skipped: 0, Time elapsed: 0.064 sec - in org.apache.wiki.auth.authorize.GroupTest
Running org.apache.wiki.auth.authorize.JDBCGroupDatabaseTest
[Server@121052]: [Thread[main,5,main]]: setSilent(true)
[Server@66ee93]: [Thread[main,5,main]]: setSilent(true)
[Server@f5493f]: [Thread[main,5,main]]: setSilent(true)
[Server@199eb6c]: [Thread[main,5,main]]: setSilent(true)
Tests run: 4, Failures: 0, Errors: 0, Skipped: 0, Time elapsed: 17.749 sec - in org.apache.wiki.auth.authorize.JDBCGroupDatabaseTest
Running org.apache.wiki.auth.authorize.WebContainerAuthorizerTest
Tests run: 4, Failures: 0, Errors: 0, Skipped: 0, Time elapsed: 0.064 sec - in org.apache.wiki.auth.authorize.WebContainerAuthorizerTest
Running org.apache.wiki.auth.authorize.XMLGroupDatabaseTest
Tests run: 4, Failures: 0, Errors: 0, Skipped: 0, Time elapsed: 0.073 sec - in org.apache.wiki.auth.authorize.XMLGroupDatabaseTest
Running org.apache.wiki.auth.UserManagerTest
Tests run: 5, Failures: 0, Errors: 0, Skipped: 0, Time elapsed: 0.309 sec - in org.apache.wiki.auth.UserManagerTest
Running org.apache.wiki.auth.AuthenticationManagerTest
Tests run: 6, Failures: 0, Errors: 0, Skipped: 0, Time elapsed: 0.132 sec - in org.apache.wiki.auth.AuthenticationManagerTest
Running org.apache.wiki.auth.AuthorizationManagerTest
Tests run: 17, Failures: 0, Errors: 0, Skipped: 0, Time elapsed: 0.476 sec - in org.apache.wiki.auth.AuthorizationManagerTest
Running org.apache.wiki.auth.user.UserProfileTest
Tests run: 5, Failures: 0, Errors: 0, Skipped: 0, Time elapsed: 0.056 sec - in org.apache.wiki.auth.user.UserProfileTest
Running org.apache.wiki.auth.user.XMLUserDatabaseTest
Tests run: 11, Failures: 0, Errors: 0, Skipped: 0, Time elapsed: 0.137 sec - in org.apache.wiki.auth.user.XMLUserDatabaseTest
Running org.apache.wiki.auth.user.JDBCUserDatabaseTest
[Server@11218cf]: [Thread[main,5,main]]: setSilent(true)
[Server@1a0a4ca]: [Thread[main,5,main]]: setSilent(true)
[Server@180475]: [Thread[main,5,main]]: setSilent(true)
[Server@1f33511]: [Thread[main,5,main]]: setSilent(true)
[Server@13ee250]: [Thread[main,5,main]]: setSilent(true)
[Server@1ba0b7c]: [Thread[main,5,main]]: setSilent(true)
[Server@df6513]: [Thread[main,5,main]]: setSilent(true)
[Server@14ce931]: [Thread[main,5,main]]: setSilent(true)
[Server@bb138d]: [Thread[main,5,main]]: setSilent(true)
[Server@1a47ef5]: [Thread[main,5,main]]: setSilent(true)
[Server@8cb98a]: [Thread[main,5,main]]: setSilent(true)
Tests run: 11, Failures: 0, Errors: 0, Skipped: 0, Time elapsed: 26.664 sec - in org.apache.wiki.auth.user.JDBCUserDatabaseTest
Running org.apache.wiki.auth.GroupManagerTest
Tests run: 4, Failures: 0, Errors: 0, Skipped: 0, Time elapsed: 0.06 sec - in org.apache.wiki.auth.GroupManagerTest
Running org.apache.wiki.auth.login.WebContainerLoginModuleTest
Tests run: 2, Failures: 0, Errors: 0, Skipped: 0, Time elapsed: 0.024 sec - in org.apache.wiki.auth.login.WebContainerLoginModuleTest
Running org.apache.wiki.auth.login.AnonymousLoginModuleTest
Tests run: 2, Failures: 0, Errors: 0, Skipped: 0, Time elapsed: 0.024 sec - in org.apache.wiki.auth.login.AnonymousLoginModuleTest
Running org.apache.wiki.auth.login.CookieAssertionLoginModuleTest
Tests run: 2, Failures: 0, Errors: 0, Skipped: 0, Time elapsed: 0.024 sec - in org.apache.wiki.auth.login.CookieAssertionLoginModuleTest
Running org.apache.wiki.auth.login.UserDatabaseLoginModuleTest
Tests run: 2, Failures: 0, Errors: 0, Skipped: 0, Time elapsed: 0.025 sec - in org.apache.wiki.auth.login.UserDatabaseLoginModuleTest
Running org.apache.wiki.auth.acl.AclEntryImplTest
Tests run: 7, Failures: 0, Errors: 0, Skipped: 0, Time elapsed: 0.001 sec - in org.apache.wiki.auth.acl.AclEntryImplTest
Running org.apache.wiki.auth.acl.DefaultAclManagerTest
[{ALLOW view Alice}]
[{   ALLOW   view   Alice  }]
[{   ALLOW   view  Alice  ,  Bob  }]
[{   ALLOW   view  Alice  ,  Bob  }]
Tests run: 3, Failures: 0, Errors: 0, Skipped: 0, Time elapsed: 0.075 sec - in org.apache.wiki.auth.acl.DefaultAclManagerTest
Running org.apache.wiki.auth.acl.AclImplTest
Tests run: 6, Failures: 0, Errors: 0, Skipped: 0, Time elapsed: 0.082 sec - in org.apache.wiki.auth.acl.AclImplTest
Running org.apache.wiki.auth.permissions.AllPermissionCollectionTest
Tests run: 8, Failures: 0, Errors: 0, Skipped: 0, Time elapsed: 0.001 sec - in org.apache.wiki.auth.permissions.AllPermissionCollectionTest
Running org.apache.wiki.auth.permissions.GroupPermissionTest
Tests run: 10, Failures: 0, Errors: 0, Skipped: 0, Time elapsed: 0.003 sec - in org.apache.wiki.auth.permissions.GroupPermissionTest
Running org.apache.wiki.auth.permissions.WikiPermissionTest
Tests run: 10, Failures: 0, Errors: 0, Skipped: 0, Time elapsed: 0.001 sec - in org.apache.wiki.auth.permissions.WikiPermissionTest
Running org.apache.wiki.auth.permissions.PagePermissionTest
Tests run: 10, Failures: 0, Errors: 0, Skipped: 0, Time elapsed: 0.001 sec - in org.apache.wiki.auth.permissions.PagePermissionTest
Running org.apache.wiki.auth.permissions.AllPermissionTest
Tests run: 5, Failures: 0, Errors: 0, Skipped: 0, Time elapsed: 0.001 sec - in org.apache.wiki.auth.permissions.AllPermissionTest
Running org.apache.wiki.providers.VersioningFileProviderTest
Tests run: 15, Failures: 0, Errors: 0, Skipped: 0, Time elapsed: 0.404 sec - in org.apache.wiki.providers.VersioningFileProviderTest
Running org.apache.wiki.providers.FileSystemProviderTest
Tests run: 9, Failures: 0, Errors: 0, Skipped: 0, Time elapsed: 0.086 sec - in org.apache.wiki.providers.FileSystemProviderTest
Running org.apache.wiki.providers.CachingProviderTest
Tests run: 2, Failures: 0, Errors: 0, Skipped: 0, Time elapsed: 4.053 sec - in org.apache.wiki.providers.CachingProviderTest
Running org.apache.wiki.providers.BasicAttachmentProviderTest
Tests run: 12, Failures: 0, Errors: 0, Skipped: 0, Time elapsed: 10.61 sec - in org.apache.wiki.providers.BasicAttachmentProviderTest
Running org.apache.wiki.render.WysiwygEditingRendererTest
Tests run: 2, Failures: 0, Errors: 0, Skipped: 0, Time elapsed: 0.034 sec - in org.apache.wiki.render.WysiwygEditingRendererTest
Running org.apache.wiki.render.RenderingManagerTest
DOM cache speed test:
  Nocache took 0:00:00.457
  Cache took 0:00:00.025
  Approx speedup: 18x
Tests run: 1, Failures: 0, Errors: 0, Skipped: 0, Time elapsed: 0.507 sec - in org.apache.wiki.render.RenderingManagerTest
Running org.apache.wiki.render.CreoleRendererTest
Tests run: 14, Failures: 0, Errors: 0, Skipped: 0, Time elapsed: 0.149 sec - in org.apache.wiki.render.CreoleRendererTest
Running org.apache.wiki.PageSorterTest
Tests run: 5, Failures: 0, Errors: 0, Skipped: 0, Time elapsed: 0.002 sec - in org.apache.wiki.PageSorterTest
Running org.apache.wiki.PropertyReaderTest
/p/mywiki/wrk/
Tests run: 3, Failures: 0, Errors: 0, Skipped: 0, Time elapsed: 0 sec - in org.apache.wiki.PropertyReaderTest
Running org.apache.wiki.workflow.SimpleDecisionTest
Tests run: 16, Failures: 0, Errors: 0, Skipped: 0, Time elapsed: 0.002 sec - in org.apache.wiki.workflow.SimpleDecisionTest
Running org.apache.wiki.workflow.WorkflowTest
Tests run: 24, Failures: 0, Errors: 0, Skipped: 0, Time elapsed: 0.004 sec - in org.apache.wiki.workflow.WorkflowTest
Running org.apache.wiki.workflow.OutcomeTest
Tests run: 6, Failures: 0, Errors: 0, Skipped: 0, Time elapsed: 0.009 sec - in org.apache.wiki.workflow.OutcomeTest
Running org.apache.wiki.workflow.DecisionQueueTest
Tests run: 7, Failures: 0, Errors: 0, Skipped: 0, Time elapsed: 0.082 sec - in org.apache.wiki.workflow.DecisionQueueTest
Running org.apache.wiki.workflow.TaskTest
Tests run: 12, Failures: 0, Errors: 0, Skipped: 0, Time elapsed: 0.001 sec - in org.apache.wiki.workflow.TaskTest
Running org.apache.wiki.workflow.ApprovalWorkflowTest
Tests run: 5, Failures: 0, Errors: 0, Skipped: 0, Time elapsed: 0.058 sec - in org.apache.wiki.workflow.ApprovalWorkflowTest
Running org.apache.wiki.workflow.FactTest
Tests run: 1, Failures: 0, Errors: 0, Skipped: 0, Time elapsed: 0 sec - in org.apache.wiki.workflow.FactTest
Running org.apache.wiki.workflow.WorkflowManagerTest
Tests run: 4, Failures: 0, Errors: 0, Skipped: 0, Time elapsed: 0.044 sec - in org.apache.wiki.workflow.WorkflowManagerTest
Running org.apache.wiki.search.SearchManagerTest
Tests run: 6, Failures: 0, Errors: 0, Skipped: 0, Time elapsed: 11.04 sec - in org.apache.wiki.search.SearchManagerTest
Running org.apache.wiki.util.UtilJ2eeCompatTest
Tests run: 3, Failures: 0, Errors: 0, Skipped: 0, Time elapsed: 0.001 sec - in org.apache.wiki.util.UtilJ2eeCompatTest
Running org.apache.wiki.util.ClassUtilTest
Tests run: 3, Failures: 0, Errors: 0, Skipped: 0, Time elapsed: 0.114 sec - in org.apache.wiki.util.ClassUtilTest
Running org.apache.wiki.util.XmlUtilTest
Tests run: 2, Failures: 0, Errors: 0, Skipped: 0, Time elapsed: 0.007 sec - in org.apache.wiki.util.XmlUtilTest
Running org.apache.wiki.util.comparators.HumanComparatorTest
Tests run: 2, Failures: 0, Errors: 0, Skipped: 0, Time elapsed: 0 sec - in org.apache.wiki.util.comparators.HumanComparatorTest
Running org.apache.wiki.util.TextUtilTest
Tests run: 40, Failures: 0, Errors: 0, Skipped: 0, Time elapsed: 0.042 sec - in org.apache.wiki.util.TextUtilTest
Running org.apache.wiki.util.TimedCounterListTest
Tests run: 2, Failures: 0, Errors: 0, Skipped: 0, Time elapsed: 0.11 sec - in org.apache.wiki.util.TimedCounterListTest
Running org.apache.wiki.util.CommentedPropertiesTest
Tests run: 4, Failures: 0, Errors: 0, Skipped: 0, Time elapsed: 0.003 sec - in org.apache.wiki.util.CommentedPropertiesTest
Running org.apache.wiki.util.PriorityListTest
Tests run: 4, Failures: 0, Errors: 0, Skipped: 0, Time elapsed: 0.001 sec - in org.apache.wiki.util.PriorityListTest
Running org.apache.wiki.util.MailUtilTest
I could not test whether mail sending works, since I could not connect to your SMTP server.
Reason: Could not connect to SMTP host: 127.0.0.1, port: 25
Tests run: 2, Failures: 0, Errors: 0, Skipped: 0, Time elapsed: 0.023 sec - in org.apache.wiki.util.MailUtilTest
Running org.apache.wiki.util.FileUtilTest
Tests run: 5, Failures: 0, Errors: 0, Skipped: 0, Time elapsed: 0.032 sec - in org.apache.wiki.util.FileUtilTest
Running org.apache.wiki.util.CryptoUtilTest
Tests run: 8, Failures: 0, Errors: 0, Skipped: 0, Time elapsed: 0.001 sec - in org.apache.wiki.util.CryptoUtilTest
Running org.apache.wiki.util.SerializerTest
Tests run: 1, Failures: 0, Errors: 0, Skipped: 0, Time elapsed: 0 sec - in org.apache.wiki.util.SerializerTest
Running org.apache.wiki.rss.RSSGeneratorTest
Tests run: 2, Failures: 0, Errors: 0, Skipped: 0, Time elapsed: 0.057 sec - in org.apache.wiki.rss.RSSGeneratorTest
Running org.apache.wiki.ui.WikiCommandTest
Tests run: 2, Failures: 0, Errors: 0, Skipped: 0, Time elapsed: 0.017 sec - in org.apache.wiki.ui.WikiCommandTest
Running org.apache.wiki.ui.GroupCommandTest
Tests run: 2, Failures: 0, Errors: 0, Skipped: 0, Time elapsed: 0.019 sec - in org.apache.wiki.ui.GroupCommandTest
Running org.apache.wiki.ui.CommandResolverTest
Tests run: 6, Failures: 0, Errors: 0, Skipped: 0, Time elapsed: 0.088 sec - in org.apache.wiki.ui.CommandResolverTest
Running org.apache.wiki.ui.RedirectCommandTest
Tests run: 2, Failures: 0, Errors: 0, Skipped: 0, Time elapsed: 0 sec - in org.apache.wiki.ui.RedirectCommandTest
Running org.apache.wiki.ui.InputValidatorTest
Tests run: 4, Failures: 0, Errors: 0, Skipped: 0, Time elapsed: 0.043 sec - in org.apache.wiki.ui.InputValidatorTest
Running org.apache.wiki.ui.PageCommandTest
Tests run: 2, Failures: 0, Errors: 0, Skipped: 0, Time elapsed: 0.025 sec - in org.apache.wiki.ui.PageCommandTest
Running org.apache.wiki.xmlrpc.RPCHandlerTest
Real: Thu Jan 02 21:02:58 UTC 2014
RPC:  Thu Jan 02 21:02:58 UTC 2014
RPC2: Thu Jan 02 21:02:58 UTC 2014
Tests run: 6, Failures: 0, Errors: 0, Skipped: 0, Time elapsed: 0.101 sec - in org.apache.wiki.xmlrpc.RPCHandlerTest

Results :

Failed tests: 
  JSPWikiMarkupParserTest.testHyperlinksInterWiki1:661 expected:<...rwiki" href="http://[www.ecyrd.com/JSPWiki]/Wiki.jsp?page=Hyper...>
but was:<...rwiki" href="http://[jspwiki-wiki.apache.org]/Wiki.jsp?page=Hyper...>
  JSPWikiMarkupParserTest.testHyperlinksInterWiki2:670 expected:<...rwiki" href="http://[www.ecyrd.com/JSPWiki]/Wiki.jsp?page=Hyper...>
but was:<...rwiki" href="http://[jspwiki-wiki.apache.org]/Wiki.jsp?page=Hyper...>

Tests run: 935, Failures: 2, Errors: 0, Skipped: 0

[INFO] ------------------------------------------------------------------------
[INFO] Reactor Summary:
[INFO] 
[INFO] Apache JSPWiki .................................... SUCCESS [6.112s]
[INFO] Apache JSPWiki Main War ........................... FAILURE [1:51.027s]
[INFO] Apache JSPWiki initial wiki pages builder ......... SKIPPED
[INFO] Apache JSPWiki initial wiki pages (de) ............ SKIPPED
[INFO] Apache JSPWiki initial wiki pages (en) ............ SKIPPED
[INFO] Apache JSPWiki initial wiki pages (es) ............ SKIPPED
[INFO] Apache JSPWiki initial wiki pages (fi) ............ SKIPPED
[INFO] Apache JSPWiki initial wiki pages (fr) ............ SKIPPED
[INFO] Apache JSPWiki initial wiki pages (it) ............ SKIPPED
[INFO] Apache JSPWiki initial wiki pages (nl) ............ SKIPPED
[INFO] Apache JSPWiki initial wiki pages (pt_BR) ......... SKIPPED
[INFO] Apache JSPWiki initial wiki pages (zh_CN) ......... SKIPPED
[INFO] jspwiki-it-builder ................................ SKIPPED
[INFO] jspwiki-selenium-tests ............................ SKIPPED
[INFO] jspwiki-it-test-custom ............................ SKIPPED
[INFO] jspwiki-it-test-custom-absolute-urls .............. SKIPPED
[INFO] jspwiki-it-test-custom-jdbc ....................... SKIPPED
[INFO] jspwiki-it-test-cma ............................... SKIPPED
[INFO] jspwiki-it-test-cma-jdbc .......................... SKIPPED
[INFO] ------------------------------------------------------------------------
[INFO] BUILD FAILURE
[INFO] ------------------------------------------------------------------------
[INFO] Total time: 1:57.852s
[INFO] Finished at: Thu Jan 02 21:02:58 UTC 2014
[INFO] Final Memory: 28M/374M
[INFO] ------------------------------------------------------------------------
[ERROR] Failed to execute goal org.apache.maven.plugins:maven-surefire-plugin:2.16:test (default-test)
on project jspwiki-war: There are test failures.
[ERROR] 
[ERROR] Please refer to <https://builds.apache.org/job/JSPWiki/ws/jspwiki-war/target/surefire-reports>
for the individual test results.
[ERROR] -> [Help 1]
[ERROR] 
[ERROR] To see the full stack trace of the errors, re-run Maven with the -e switch.
[ERROR] Re-run Maven using the -X switch to enable full debug logging.
[ERROR] 
[ERROR] For more information about the errors and possible solutions, please read the following
articles:
[ERROR] [Help 1] http://cwiki.apache.org/confluence/display/MAVEN/MojoFailureException
[ERROR] 
[ERROR] After correcting the problems, you can resume the build with the command
[ERROR]   mvn <goals> -rf :jspwiki-war
Build step 'Invoke top-level Maven targets' marked build as failure

Mime
View raw message