jspwiki-commits mailing list archives

Site index · List index
Message view « Date » · « Thread »
Top « Date » · « Thread »
From Apache Jenkins Server <jenk...@builds.apache.org>
Subject Build failed in Jenkins: JSPWiki #225
Date Sun, 15 Sep 2013 20:06:45 GMT
See <https://builds.apache.org/job/JSPWiki/225/changes>

Changes:

[gmazza] Removed copy of jspwiki-site under jspwiki-trunk per earlier approval from JP

------------------------------------------
[...truncated 1834 lines...]
Tests run: 3, Failures: 0, Errors: 0, Skipped: 0, Time elapsed: 0.133 sec - in org.apache.wiki.util.ClassUtilTest
Running org.apache.wiki.util.TimedCounterListTest
Tests run: 2, Failures: 0, Errors: 0, Skipped: 0, Time elapsed: 0.111 sec - in org.apache.wiki.util.TimedCounterListTest
Running org.apache.wiki.util.FileUtilTest
Tests run: 5, Failures: 0, Errors: 0, Skipped: 0, Time elapsed: 0.011 sec - in org.apache.wiki.util.FileUtilTest
Running org.apache.wiki.util.UtilJ2eeCompatTest
Tests run: 3, Failures: 0, Errors: 0, Skipped: 0, Time elapsed: 0.001 sec - in org.apache.wiki.util.UtilJ2eeCompatTest
Running org.apache.wiki.util.MailUtilTest
I could not test whether mail sending works, since I could not connect to your SMTP server.
Reason: Could not connect to SMTP host: 127.0.0.1, port: 25
Tests run: 2, Failures: 0, Errors: 0, Skipped: 0, Time elapsed: 0.224 sec - in org.apache.wiki.util.MailUtilTest
Running org.apache.wiki.util.TextUtilTest
Tests run: 40, Failures: 0, Errors: 0, Skipped: 0, Time elapsed: 0.047 sec - in org.apache.wiki.util.TextUtilTest
Running org.apache.wiki.util.PriorityListTest
Tests run: 4, Failures: 0, Errors: 0, Skipped: 0, Time elapsed: 0 sec - in org.apache.wiki.util.PriorityListTest
Running org.apache.wiki.util.comparators.HumanComparatorTest
Tests run: 2, Failures: 0, Errors: 0, Skipped: 0, Time elapsed: 0.001 sec - in org.apache.wiki.util.comparators.HumanComparatorTest
Running org.apache.wiki.util.PageSorterTest
Tests run: 5, Failures: 0, Errors: 0, Skipped: 0, Time elapsed: 0.005 sec - in org.apache.wiki.util.PageSorterTest
Running org.apache.wiki.util.CommentedPropertiesTest
Tests run: 4, Failures: 0, Errors: 0, Skipped: 0, Time elapsed: 0.004 sec - in org.apache.wiki.util.CommentedPropertiesTest
Running org.apache.wiki.stress.MassiveRepositoryTest
Creating 1000 pages
....................................................................................................
Took 0:00:09.594, which is 104.23181154888472 adds/second
Checking in 1000 revisions
....................................................................................................
Took 0:00:12.907, which is 77.4773378786705 adds/second
Rendering 10000 pages
....................................................................................................
Took 0:00:01.923, which is 5200.208008320333 renders/second
Tests run: 1, Failures: 0, Errors: 0, Skipped: 0, Time elapsed: 24.626 sec - in org.apache.wiki.stress.MassiveRepositoryTest
Running org.apache.wiki.htmltowiki.HtmlStringToWikiTranslatorTest
Tests run: 17, Failures: 0, Errors: 0, Skipped: 0, Time elapsed: 0.085 sec - in org.apache.wiki.htmltowiki.HtmlStringToWikiTranslatorTest
Running org.apache.wiki.WikiEngineTest
Tests run: 40, Failures: 0, Errors: 0, Skipped: 0, Time elapsed: 0.703 sec - in org.apache.wiki.WikiEngineTest
Running org.apache.wiki.ui.RedirectCommandTest
Tests run: 2, Failures: 0, Errors: 0, Skipped: 0, Time elapsed: 0 sec - in org.apache.wiki.ui.RedirectCommandTest
Running org.apache.wiki.ui.CommandResolverTest
Tests run: 6, Failures: 0, Errors: 0, Skipped: 0, Time elapsed: 0.081 sec - in org.apache.wiki.ui.CommandResolverTest
Running org.apache.wiki.ui.PageCommandTest
Tests run: 2, Failures: 0, Errors: 0, Skipped: 0, Time elapsed: 0.026 sec - in org.apache.wiki.ui.PageCommandTest
Running org.apache.wiki.ui.WikiCommandTest
Tests run: 2, Failures: 0, Errors: 0, Skipped: 0, Time elapsed: 0.022 sec - in org.apache.wiki.ui.WikiCommandTest
Running org.apache.wiki.ui.InputValidatorTest
Tests run: 4, Failures: 0, Errors: 0, Skipped: 0, Time elapsed: 0.053 sec - in org.apache.wiki.ui.InputValidatorTest
Running org.apache.wiki.ui.GroupCommandTest
Tests run: 2, Failures: 0, Errors: 0, Skipped: 0, Time elapsed: 0.024 sec - in org.apache.wiki.ui.GroupCommandTest
Running org.apache.wiki.VariableManagerTest
Tests run: 12, Failures: 0, Errors: 0, Skipped: 0, Time elapsed: 0.142 sec - in org.apache.wiki.VariableManagerTest
Running org.apache.wiki.providers.FileSystemProviderTest
Tests run: 9, Failures: 0, Errors: 0, Skipped: 0, Time elapsed: 0.092 sec - in org.apache.wiki.providers.FileSystemProviderTest
Running org.apache.wiki.providers.CachingProviderTest
Tests run: 2, Failures: 0, Errors: 0, Skipped: 0, Time elapsed: 4.189 sec - in org.apache.wiki.providers.CachingProviderTest
Running org.apache.wiki.providers.BasicAttachmentProviderTest
Tests run: 12, Failures: 0, Errors: 0, Skipped: 0, Time elapsed: 10.193 sec - in org.apache.wiki.providers.BasicAttachmentProviderTest
Running org.apache.wiki.providers.RCSFileProviderTest
Tests run: 8, Failures: 0, Errors: 0, Skipped: 0, Time elapsed: 0.544 sec - in org.apache.wiki.providers.RCSFileProviderTest
Running org.apache.wiki.providers.VersioningFileProviderTest
Tests run: 15, Failures: 0, Errors: 0, Skipped: 0, Time elapsed: 0.393 sec - in org.apache.wiki.providers.VersioningFileProviderTest
Running org.apache.wiki.plugin.DefaultPluginManagerTest
Tests run: 15, Failures: 0, Errors: 0, Skipped: 0, Time elapsed: 0.198 sec - in org.apache.wiki.plugin.DefaultPluginManagerTest
Running org.apache.wiki.plugin.IfPluginTest
Tests run: 4, Failures: 0, Errors: 0, Skipped: 0, Time elapsed: 0.067 sec - in org.apache.wiki.plugin.IfPluginTest
Running org.apache.wiki.plugin.GroupsTest
Tests run: 1, Failures: 0, Errors: 0, Skipped: 0, Time elapsed: 0.013 sec - in org.apache.wiki.plugin.GroupsTest
Running org.apache.wiki.plugin.ReferringPagesPluginTest
Tests run: 8, Failures: 0, Errors: 0, Skipped: 0, Time elapsed: 0.222 sec - in org.apache.wiki.plugin.ReferringPagesPluginTest
Running org.apache.wiki.plugin.PageViewPluginTest
Tests run: 4, Failures: 0, Errors: 0, Skipped: 0, Time elapsed: 0.11 sec - in org.apache.wiki.plugin.PageViewPluginTest
Running org.apache.wiki.plugin.CounterPluginTest
Tests run: 6, Failures: 0, Errors: 0, Skipped: 0, Time elapsed: 0.069 sec - in org.apache.wiki.plugin.CounterPluginTest
Running org.apache.wiki.plugin.UndefinedPagesPluginTest
Tests run: 2, Failures: 0, Errors: 0, Skipped: 0, Time elapsed: 0.032 sec - in org.apache.wiki.plugin.UndefinedPagesPluginTest
Running org.apache.wiki.plugin.InsertPageTest
Tests run: 6, Failures: 0, Errors: 0, Skipped: 0, Time elapsed: 0.1 sec - in org.apache.wiki.plugin.InsertPageTest
Running org.apache.wiki.plugin.TableOfContentsTest
Tests run: 8, Failures: 0, Errors: 0, Skipped: 0, Time elapsed: 0.121 sec - in org.apache.wiki.plugin.TableOfContentsTest
Running org.apache.wiki.plugin.RecentChangesPluginTest
Tests run: 3, Failures: 0, Errors: 0, Skipped: 0, Time elapsed: 0.11 sec - in org.apache.wiki.plugin.RecentChangesPluginTest
Running org.apache.wiki.ReferenceManagerTest
Tests run: 18, Failures: 0, Errors: 0, Skipped: 0, Time elapsed: 0.304 sec - in org.apache.wiki.ReferenceManagerTest
Running org.apache.wiki.WikiSessionTest
Tests run: 7, Failures: 0, Errors: 0, Skipped: 0, Time elapsed: 0.085 sec - in org.apache.wiki.WikiSessionTest
Running org.apache.wiki.search.SearchManagerTest
Tests run: 6, Failures: 0, Errors: 0, Skipped: 0, Time elapsed: 10.259 sec - in org.apache.wiki.search.SearchManagerTest
Running org.apache.wiki.i18n.InternationalizationManagerTest
Tests run: 2, Failures: 0, Errors: 0, Skipped: 0, Time elapsed: 0.001 sec - in org.apache.wiki.i18n.InternationalizationManagerTest
Running org.apache.wiki.workflow.FactTest
Tests run: 1, Failures: 0, Errors: 0, Skipped: 0, Time elapsed: 0 sec - in org.apache.wiki.workflow.FactTest
Running org.apache.wiki.workflow.DecisionQueueTest
Tests run: 7, Failures: 0, Errors: 0, Skipped: 0, Time elapsed: 0.091 sec - in org.apache.wiki.workflow.DecisionQueueTest
Running org.apache.wiki.workflow.OutcomeTest
Tests run: 6, Failures: 0, Errors: 0, Skipped: 0, Time elapsed: 0.009 sec - in org.apache.wiki.workflow.OutcomeTest
Running org.apache.wiki.workflow.TaskTest
Tests run: 12, Failures: 0, Errors: 0, Skipped: 0, Time elapsed: 0.005 sec - in org.apache.wiki.workflow.TaskTest
Running org.apache.wiki.workflow.WorkflowManagerTest
Tests run: 4, Failures: 0, Errors: 0, Skipped: 0, Time elapsed: 0.042 sec - in org.apache.wiki.workflow.WorkflowManagerTest
Running org.apache.wiki.workflow.ApprovalWorkflowTest
Tests run: 5, Failures: 0, Errors: 0, Skipped: 0, Time elapsed: 0.056 sec - in org.apache.wiki.workflow.ApprovalWorkflowTest
Running org.apache.wiki.workflow.SimpleDecisionTest
Tests run: 16, Failures: 0, Errors: 0, Skipped: 0, Time elapsed: 0.003 sec - in org.apache.wiki.workflow.SimpleDecisionTest
Running org.apache.wiki.workflow.WorkflowTest
Tests run: 24, Failures: 0, Errors: 0, Skipped: 0, Time elapsed: 0.004 sec - in org.apache.wiki.workflow.WorkflowTest
Running org.apache.wiki.PageManagerTest
Tests run: 2, Failures: 0, Errors: 0, Skipped: 0, Time elapsed: 0.017 sec - in org.apache.wiki.PageManagerTest
Running org.apache.wiki.attachment.AttachmentManagerTest
Tests run: 14, Failures: 0, Errors: 0, Skipped: 0, Time elapsed: 0.229 sec - in org.apache.wiki.attachment.AttachmentManagerTest
Running org.apache.wiki.render.RenderingManagerTest
DOM cache speed test:
  Nocache took 0:00:00.381
  Cache took 0:00:00.016
  Approx speedup: 23x
Tests run: 1, Failures: 0, Errors: 1, Skipped: 0, Time elapsed: 0.423 sec <<< FAILURE!
- in org.apache.wiki.render.RenderingManagerTest
testCache(org.apache.wiki.render.RenderingManagerTest)  Time elapsed: 0.422 sec  <<<
ERROR!
java.lang.NullPointerException: null
	at org.apache.wiki.providers.BasicAttachmentProvider.deleteAttachment(BasicAttachmentProvider.java:675)
	at org.apache.wiki.providers.CachingAttachmentProvider.deleteAttachment(CachingAttachmentProvider.java:325)
	at org.apache.wiki.attachment.AttachmentManager.deleteAttachment(AttachmentManager.java:597)
	at org.apache.wiki.WikiEngine.deletePage(WikiEngine.java:2201)
	at org.apache.wiki.render.RenderingManagerTest.tearDown(RenderingManagerTest.java:51)

Running org.apache.wiki.render.CreoleRendererTest
Tests run: 14, Failures: 0, Errors: 0, Skipped: 0, Time elapsed: 0.165 sec - in org.apache.wiki.render.CreoleRendererTest
Running org.apache.wiki.render.WysiwygEditingRendererTest
Tests run: 2, Failures: 0, Errors: 0, Skipped: 0, Time elapsed: 0.033 sec - in org.apache.wiki.render.WysiwygEditingRendererTest
Running org.apache.wiki.ReleaseTest
Tests run: 17, Failures: 0, Errors: 0, Skipped: 0, Time elapsed: 0.003 sec - in org.apache.wiki.ReleaseTest
Running org.apache.wiki.url.DefaultURLConstructorTest
Tests run: 12, Failures: 0, Errors: 0, Skipped: 0, Time elapsed: 0.142 sec - in org.apache.wiki.url.DefaultURLConstructorTest
Running org.apache.wiki.url.ShortURLConstructorTest
Tests run: 12, Failures: 0, Errors: 0, Skipped: 0, Time elapsed: 0.137 sec - in org.apache.wiki.url.ShortURLConstructorTest
Running org.apache.wiki.url.ShortViewURLConstructorTest
Tests run: 12, Failures: 0, Errors: 0, Skipped: 0, Time elapsed: 0.134 sec - in org.apache.wiki.url.ShortViewURLConstructorTest
Running org.apache.wiki.content.PageRenamerTest
Tests run: 21, Failures: 0, Errors: 0, Skipped: 0, Time elapsed: 0.376 sec - in org.apache.wiki.content.PageRenamerTest
Running org.apache.wiki.PropertyReaderTest
/p/mywiki/wrk/
Tests run: 3, Failures: 0, Errors: 0, Skipped: 0, Time elapsed: 0 sec - in org.apache.wiki.PropertyReaderTest
Running org.apache.wiki.filters.DefaultFilterManagerTest
Tests run: 2, Failures: 0, Errors: 0, Skipped: 0, Time elapsed: 0.021 sec - in org.apache.wiki.filters.DefaultFilterManagerTest
Running org.apache.wiki.diff.ContextualDiffProviderTest
Tests run: 6, Failures: 0, Errors: 0, Skipped: 0, Time elapsed: 0.325 sec - in org.apache.wiki.diff.ContextualDiffProviderTest
Running org.apache.wiki.auth.authorize.XMLGroupDatabaseTest
Tests run: 4, Failures: 0, Errors: 0, Skipped: 0, Time elapsed: 0.059 sec - in org.apache.wiki.auth.authorize.XMLGroupDatabaseTest
Running org.apache.wiki.auth.authorize.WebContainerAuthorizerTest
Tests run: 4, Failures: 0, Errors: 0, Skipped: 0, Time elapsed: 0.045 sec - in org.apache.wiki.auth.authorize.WebContainerAuthorizerTest
Running org.apache.wiki.auth.authorize.JDBCGroupDatabaseTest
[Server@1ffdba2]: [Thread[main,5,main]]: setSilent(true)
[Server@9b626a]: [Thread[main,5,main]]: setSilent(true)
[Server@568dc9]: [Thread[main,5,main]]: setSilent(true)
[Server@448cb2]: [Thread[main,5,main]]: setSilent(true)
Tests run: 4, Failures: 0, Errors: 0, Skipped: 0, Time elapsed: 15.128 sec - in org.apache.wiki.auth.authorize.JDBCGroupDatabaseTest
Running org.apache.wiki.auth.authorize.GroupTest
Tests run: 8, Failures: 0, Errors: 0, Skipped: 0, Time elapsed: 0.068 sec - in org.apache.wiki.auth.authorize.GroupTest
Running org.apache.wiki.auth.acl.AclEntryImplTest
Tests run: 7, Failures: 0, Errors: 0, Skipped: 0, Time elapsed: 0.001 sec - in org.apache.wiki.auth.acl.AclEntryImplTest
Running org.apache.wiki.auth.acl.AclImplTest
Tests run: 6, Failures: 0, Errors: 0, Skipped: 0, Time elapsed: 0.133 sec - in org.apache.wiki.auth.acl.AclImplTest
Running org.apache.wiki.auth.acl.DefaultAclManagerTest
[{ALLOW view Alice}]
[{   ALLOW   view   Alice  }]
[{   ALLOW   view  Alice  ,  Bob  }]
[{   ALLOW   view  Alice  ,  Bob  }]
Tests run: 3, Failures: 0, Errors: 0, Skipped: 0, Time elapsed: 0.051 sec - in org.apache.wiki.auth.acl.DefaultAclManagerTest
Running org.apache.wiki.auth.AuthenticationManagerTest
Tests run: 6, Failures: 0, Errors: 0, Skipped: 0, Time elapsed: 0.1 sec - in org.apache.wiki.auth.AuthenticationManagerTest
Running org.apache.wiki.auth.login.UserDatabaseLoginModuleTest
Tests run: 2, Failures: 0, Errors: 0, Skipped: 0, Time elapsed: 0.024 sec - in org.apache.wiki.auth.login.UserDatabaseLoginModuleTest
Running org.apache.wiki.auth.login.WebContainerLoginModuleTest
Tests run: 2, Failures: 0, Errors: 0, Skipped: 0, Time elapsed: 0.014 sec - in org.apache.wiki.auth.login.WebContainerLoginModuleTest
Running org.apache.wiki.auth.login.CookieAssertionLoginModuleTest
Tests run: 2, Failures: 0, Errors: 0, Skipped: 0, Time elapsed: 0.02 sec - in org.apache.wiki.auth.login.CookieAssertionLoginModuleTest
Running org.apache.wiki.auth.login.AnonymousLoginModuleTest
Tests run: 2, Failures: 0, Errors: 0, Skipped: 0, Time elapsed: 0.02 sec - in org.apache.wiki.auth.login.AnonymousLoginModuleTest
Running org.apache.wiki.auth.AuthorizationManagerTest
Tests run: 17, Failures: 0, Errors: 0, Skipped: 0, Time elapsed: 0.282 sec - in org.apache.wiki.auth.AuthorizationManagerTest
Running org.apache.wiki.auth.user.XMLUserDatabaseTest
Tests run: 11, Failures: 0, Errors: 0, Skipped: 0, Time elapsed: 0.137 sec - in org.apache.wiki.auth.user.XMLUserDatabaseTest
Running org.apache.wiki.auth.user.UserProfileTest
Tests run: 5, Failures: 0, Errors: 0, Skipped: 0, Time elapsed: 0.057 sec - in org.apache.wiki.auth.user.UserProfileTest
Running org.apache.wiki.auth.user.JDBCUserDatabaseTest
[Server@7affe0]: [Thread[main,5,main]]: setSilent(true)
[Server@3162a1]: [Thread[main,5,main]]: setSilent(true)
[Server@e95ba5]: [Thread[main,5,main]]: setSilent(true)
[Server@1eb39ae]: [Thread[main,5,main]]: setSilent(true)
[Server@1cc9c57]: [Thread[main,5,main]]: setSilent(true)
[Server@1f71f1f]: [Thread[main,5,main]]: setSilent(true)
[Server@1feb04e]: [Thread[main,5,main]]: setSilent(true)
[Server@1891811]: [Thread[main,5,main]]: setSilent(true)
[Server@14ee504]: [Thread[main,5,main]]: setSilent(true)
[Server@1a31cbb]: [Thread[main,5,main]]: setSilent(true)
[Server@19e19da]: [Thread[main,5,main]]: setSilent(true)
Tests run: 11, Failures: 0, Errors: 0, Skipped: 0, Time elapsed: 21.501 sec - in org.apache.wiki.auth.user.JDBCUserDatabaseTest
Running org.apache.wiki.auth.UserManagerTest
Tests run: 5, Failures: 0, Errors: 0, Skipped: 0, Time elapsed: 0.108 sec - in org.apache.wiki.auth.UserManagerTest
Running org.apache.wiki.auth.GroupManagerTest
Tests run: 4, Failures: 0, Errors: 0, Skipped: 0, Time elapsed: 0.052 sec - in org.apache.wiki.auth.GroupManagerTest
Running org.apache.wiki.auth.permissions.AllPermissionTest
Tests run: 5, Failures: 0, Errors: 0, Skipped: 0, Time elapsed: 0.001 sec - in org.apache.wiki.auth.permissions.AllPermissionTest
Running org.apache.wiki.auth.permissions.PagePermissionTest
Tests run: 10, Failures: 0, Errors: 0, Skipped: 0, Time elapsed: 0.001 sec - in org.apache.wiki.auth.permissions.PagePermissionTest
Running org.apache.wiki.auth.permissions.WikiPermissionTest
Tests run: 10, Failures: 0, Errors: 0, Skipped: 0, Time elapsed: 0.001 sec - in org.apache.wiki.auth.permissions.WikiPermissionTest
Running org.apache.wiki.auth.permissions.GroupPermissionTest
Tests run: 10, Failures: 0, Errors: 0, Skipped: 0, Time elapsed: 0.003 sec - in org.apache.wiki.auth.permissions.GroupPermissionTest
Running org.apache.wiki.auth.permissions.AllPermissionCollectionTest
Tests run: 8, Failures: 0, Errors: 0, Skipped: 0, Time elapsed: 0.002 sec - in org.apache.wiki.auth.permissions.AllPermissionCollectionTest

Results :

Tests in error: 
  RenderingManagerTest.tearDown:51 ? NullPointer

Tests run: 942, Failures: 0, Errors: 1, Skipped: 0

[INFO] ------------------------------------------------------------------------
[INFO] Reactor Summary:
[INFO] 
[INFO] Apache JSPWiki .................................... SUCCESS [8.927s]
[INFO] Apache JSPWiki Main War ........................... FAILURE [2:31.153s]
[INFO] jspwiki-it-builder ................................ SKIPPED
[INFO] jspwiki-selenium-tests ............................ SKIPPED
[INFO] jspwiki-it-test-custom ............................ SKIPPED
[INFO] jspwiki-it-test-custom-absolute-urls .............. SKIPPED
[INFO] jspwiki-it-test-custom-jdbc ....................... SKIPPED
[INFO] jspwiki-it-test-cma ............................... SKIPPED
[INFO] jspwiki-it-test-cma-jdbc .......................... SKIPPED
[INFO] ------------------------------------------------------------------------
[INFO] BUILD FAILURE
[INFO] ------------------------------------------------------------------------
[INFO] Total time: 2:40.607s
[INFO] Finished at: Sun Sep 15 20:06:44 UTC 2013
[INFO] Final Memory: 30M/330M
[INFO] ------------------------------------------------------------------------
[ERROR] Failed to execute goal org.apache.maven.plugins:maven-surefire-plugin:2.15:test (default-test)
on project jspwiki-war: There are test failures.
[ERROR] 
[ERROR] Please refer to <https://builds.apache.org/job/JSPWiki/ws/jspwiki-war/target/surefire-reports>
for the individual test results.
[ERROR] -> [Help 1]
[ERROR] 
[ERROR] To see the full stack trace of the errors, re-run Maven with the -e switch.
[ERROR] Re-run Maven using the -X switch to enable full debug logging.
[ERROR] 
[ERROR] For more information about the errors and possible solutions, please read the following
articles:
[ERROR] [Help 1] http://cwiki.apache.org/confluence/display/MAVEN/MojoFailureException
[ERROR] 
[ERROR] After correcting the problems, you can resume the build with the command
[ERROR]   mvn <goals> -rf :jspwiki-war
Build step 'Invoke top-level Maven targets' marked build as failure

Mime
View raw message