jspwiki-commits mailing list archives

Site index · List index
Message view « Date » · « Thread »
Top « Date » · « Thread »
From Apache Jenkins Server <jenk...@builds.apache.org>
Subject Build failed in Jenkins: JSPWiki #182
Date Sun, 04 Aug 2013 22:33:36 GMT
See <https://builds.apache.org/job/JSPWiki/182/>

------------------------------------------
[...truncated 265 lines...]
Running org.apache.wiki.auth.acl.AclImplTest
Tests run: 6, Failures: 0, Errors: 0, Skipped: 0, Time elapsed: 0.088 sec - in org.apache.wiki.auth.acl.AclImplTest
Running org.apache.wiki.auth.login.WebContainerLoginModuleTest
Tests run: 2, Failures: 0, Errors: 0, Skipped: 0, Time elapsed: 0.026 sec - in org.apache.wiki.auth.login.WebContainerLoginModuleTest
Running org.apache.wiki.auth.login.AnonymousLoginModuleTest
Tests run: 2, Failures: 0, Errors: 0, Skipped: 0, Time elapsed: 0.026 sec - in org.apache.wiki.auth.login.AnonymousLoginModuleTest
Running org.apache.wiki.auth.login.UserDatabaseLoginModuleTest
Tests run: 2, Failures: 0, Errors: 0, Skipped: 0, Time elapsed: 0.026 sec - in org.apache.wiki.auth.login.UserDatabaseLoginModuleTest
Running org.apache.wiki.auth.login.CookieAssertionLoginModuleTest
Tests run: 2, Failures: 0, Errors: 0, Skipped: 0, Time elapsed: 0.026 sec - in org.apache.wiki.auth.login.CookieAssertionLoginModuleTest
Running org.apache.wiki.auth.permissions.PagePermissionTest
Tests run: 10, Failures: 0, Errors: 0, Skipped: 0, Time elapsed: 0.002 sec - in org.apache.wiki.auth.permissions.PagePermissionTest
Running org.apache.wiki.auth.permissions.WikiPermissionTest
Tests run: 10, Failures: 0, Errors: 0, Skipped: 0, Time elapsed: 0.001 sec - in org.apache.wiki.auth.permissions.WikiPermissionTest
Running org.apache.wiki.auth.permissions.AllPermissionTest
Tests run: 5, Failures: 0, Errors: 0, Skipped: 0, Time elapsed: 0.001 sec - in org.apache.wiki.auth.permissions.AllPermissionTest
Running org.apache.wiki.auth.permissions.AllPermissionCollectionTest
Tests run: 8, Failures: 0, Errors: 0, Skipped: 0, Time elapsed: 0.002 sec - in org.apache.wiki.auth.permissions.AllPermissionCollectionTest
Running org.apache.wiki.auth.permissions.GroupPermissionTest
Tests run: 10, Failures: 0, Errors: 0, Skipped: 0, Time elapsed: 0.005 sec - in org.apache.wiki.auth.permissions.GroupPermissionTest
Running org.apache.wiki.auth.GroupManagerTest
Tests run: 4, Failures: 0, Errors: 0, Skipped: 0, Time elapsed: 0.062 sec - in org.apache.wiki.auth.GroupManagerTest
Running org.apache.wiki.auth.AuthorizationManagerTest
Tests run: 17, Failures: 0, Errors: 0, Skipped: 0, Time elapsed: 0.314 sec - in org.apache.wiki.auth.AuthorizationManagerTest
Running org.apache.wiki.auth.AuthenticationManagerTest
Tests run: 6, Failures: 0, Errors: 0, Skipped: 0, Time elapsed: 0.105 sec - in org.apache.wiki.auth.AuthenticationManagerTest
Running org.apache.wiki.auth.UserManagerTest
Tests run: 5, Failures: 0, Errors: 0, Skipped: 0, Time elapsed: 0.762 sec - in org.apache.wiki.auth.UserManagerTest
Running org.apache.wiki.auth.authorize.WebContainerAuthorizerTest
Tests run: 4, Failures: 0, Errors: 0, Skipped: 0, Time elapsed: 0.064 sec - in org.apache.wiki.auth.authorize.WebContainerAuthorizerTest
Running org.apache.wiki.auth.authorize.JDBCGroupDatabaseTest
[Server@fd9691]: [Thread[main,5,main]]: setSilent(true)
[Server@578144]: [Thread[main,5,main]]: setSilent(true)
[Server@14c8e61]: [Thread[main,5,main]]: setSilent(true)
[Server@157133c]: [Thread[main,5,main]]: setSilent(true)
Tests run: 4, Failures: 0, Errors: 0, Skipped: 0, Time elapsed: 13.969 sec - in org.apache.wiki.auth.authorize.JDBCGroupDatabaseTest
Running org.apache.wiki.auth.authorize.GroupTest
Tests run: 8, Failures: 0, Errors: 0, Skipped: 0, Time elapsed: 0.093 sec - in org.apache.wiki.auth.authorize.GroupTest
Running org.apache.wiki.auth.authorize.XMLGroupDatabaseTest
Tests run: 4, Failures: 0, Errors: 0, Skipped: 0, Time elapsed: 0.065 sec - in org.apache.wiki.auth.authorize.XMLGroupDatabaseTest
Running org.apache.wiki.auth.user.JDBCUserDatabaseTest
[Server@8960af]: [Thread[main,5,main]]: setSilent(true)
[Server@53a1c7]: [Thread[main,5,main]]: setSilent(true)
[Server@a44faa]: [Thread[main,5,main]]: setSilent(true)
[Server@1b9e0f5]: [Thread[main,5,main]]: setSilent(true)
[Server@f1df22]: [Thread[main,5,main]]: setSilent(true)
[Server@111151a]: [Thread[main,5,main]]: setSilent(true)
[Server@7a051d]: [Thread[main,5,main]]: setSilent(true)
[Server@18d25de]: [Thread[main,5,main]]: setSilent(true)
[Server@93b645]: [Thread[main,5,main]]: setSilent(true)
[Server@1d86098]: [Thread[main,5,main]]: setSilent(true)
[Server@b90a40]: [Thread[main,5,main]]: setSilent(true)
Tests run: 11, Failures: 0, Errors: 0, Skipped: 0, Time elapsed: 19.558 sec - in org.apache.wiki.auth.user.JDBCUserDatabaseTest
Running org.apache.wiki.auth.user.XMLUserDatabaseTest
Tests run: 11, Failures: 0, Errors: 0, Skipped: 0, Time elapsed: 0.149 sec - in org.apache.wiki.auth.user.XMLUserDatabaseTest
Running org.apache.wiki.auth.user.UserProfileTest
Tests run: 5, Failures: 0, Errors: 0, Skipped: 0, Time elapsed: 0.061 sec - in org.apache.wiki.auth.user.UserProfileTest
Running org.apache.wiki.render.RenderingManagerTest
DOM cache speed test:
  Nocache took 0:00:00.146
  Cache took 0:00:00.011
  Approx speedup: 13x
Tests run: 1, Failures: 0, Errors: 0, Skipped: 0, Time elapsed: 0.178 sec - in org.apache.wiki.render.RenderingManagerTest
Running org.apache.wiki.render.CreoleRendererTest
Tests run: 14, Failures: 0, Errors: 0, Skipped: 0, Time elapsed: 0.18 sec - in org.apache.wiki.render.CreoleRendererTest
Running org.apache.wiki.render.WysiwygEditingRendererTest
Tests run: 2, Failures: 0, Errors: 0, Skipped: 0, Time elapsed: 0.043 sec - in org.apache.wiki.render.WysiwygEditingRendererTest
Running org.apache.wiki.content.PageRenamerTest
Tests run: 21, Failures: 0, Errors: 0, Skipped: 0, Time elapsed: 0.566 sec - in org.apache.wiki.content.PageRenamerTest
Running org.apache.wiki.xmlrpc.RPCHandlerTest
Real: Sun Aug 04 22:30:55 UTC 2013
RPC:  Sun Aug 04 22:30:55 UTC 2013
RPC2: Sun Aug 04 22:30:55 UTC 2013
Tests run: 6, Failures: 0, Errors: 0, Skipped: 0, Time elapsed: 0.099 sec - in org.apache.wiki.xmlrpc.RPCHandlerTest
Running org.apache.wiki.WikiEngineTest
Tests run: 43, Failures: 0, Errors: 0, Skipped: 0, Time elapsed: 18.602 sec - in org.apache.wiki.WikiEngineTest
Running org.apache.wiki.filters.DefaultFilterManagerTest
Tests run: 2, Failures: 0, Errors: 0, Skipped: 0, Time elapsed: 0.02 sec - in org.apache.wiki.filters.DefaultFilterManagerTest
Running org.apache.wiki.ReferenceManagerTest
Tests run: 18, Failures: 0, Errors: 0, Skipped: 0, Time elapsed: 0.34 sec - in org.apache.wiki.ReferenceManagerTest
Running org.apache.wiki.util.ClassUtilTest
Tests run: 3, Failures: 0, Errors: 0, Skipped: 0, Time elapsed: 0.055 sec - in org.apache.wiki.util.ClassUtilTest
Running org.apache.wiki.util.PageSorterTest
Tests run: 5, Failures: 0, Errors: 0, Skipped: 0, Time elapsed: 0.002 sec - in org.apache.wiki.util.PageSorterTest
Running org.apache.wiki.util.TextUtilTest
Tests run: 40, Failures: 0, Errors: 0, Skipped: 0, Time elapsed: 0.045 sec - in org.apache.wiki.util.TextUtilTest
Running org.apache.wiki.util.FileUtilTest
Tests run: 5, Failures: 0, Errors: 0, Skipped: 0, Time elapsed: 0.007 sec - in org.apache.wiki.util.FileUtilTest
Running org.apache.wiki.util.CryptoUtilTest
Tests run: 8, Failures: 0, Errors: 0, Skipped: 0, Time elapsed: 0.001 sec - in org.apache.wiki.util.CryptoUtilTest
Running org.apache.wiki.util.MailUtilTest
Tests run: 2, Failures: 0, Errors: 0, Skipped: 0, Time elapsed: 0.128 sec - in org.apache.wiki.util.MailUtilTest
Running org.apache.wiki.util.SerializerTest
Tests run: 1, Failures: 0, Errors: 0, Skipped: 0, Time elapsed: 0.001 sec - in org.apache.wiki.util.SerializerTest
Running org.apache.wiki.util.PriorityListTest
Tests run: 4, Failures: 0, Errors: 0, Skipped: 0, Time elapsed: 0.001 sec - in org.apache.wiki.util.PriorityListTest
Running org.apache.wiki.util.CommentedPropertiesTest
Tests run: 4, Failures: 0, Errors: 0, Skipped: 0, Time elapsed: 0.003 sec - in org.apache.wiki.util.CommentedPropertiesTest
Running org.apache.wiki.util.comparators.HumanComparatorTest
Tests run: 2, Failures: 0, Errors: 0, Skipped: 0, Time elapsed: 0 sec - in org.apache.wiki.util.comparators.HumanComparatorTest
Running org.apache.wiki.util.UtilJ2eeCompatTest
Tests run: 3, Failures: 0, Errors: 0, Skipped: 0, Time elapsed: 0 sec - in org.apache.wiki.util.UtilJ2eeCompatTest
Running org.apache.wiki.util.TimedCounterListTest
Tests run: 2, Failures: 0, Errors: 0, Skipped: 0, Time elapsed: 0.111 sec - in org.apache.wiki.util.TimedCounterListTest
Running org.apache.wiki.htmltowiki.HtmlStringToWikiTranslatorTest
Tests run: 17, Failures: 0, Errors: 0, Skipped: 0, Time elapsed: 0.081 sec - in org.apache.wiki.htmltowiki.HtmlStringToWikiTranslatorTest
Running org.apache.wiki.plugin.GroupsTest
Tests run: 1, Failures: 0, Errors: 0, Skipped: 0, Time elapsed: 0.016 sec - in org.apache.wiki.plugin.GroupsTest
Running org.apache.wiki.plugin.IfPluginTest
Tests run: 4, Failures: 0, Errors: 0, Skipped: 0, Time elapsed: 0.059 sec - in org.apache.wiki.plugin.IfPluginTest
Running org.apache.wiki.plugin.CounterPluginTest
Tests run: 6, Failures: 0, Errors: 0, Skipped: 0, Time elapsed: 0.067 sec - in org.apache.wiki.plugin.CounterPluginTest
Running org.apache.wiki.plugin.DefaultPluginManagerTest
Tests run: 15, Failures: 0, Errors: 0, Skipped: 0, Time elapsed: 0.159 sec - in org.apache.wiki.plugin.DefaultPluginManagerTest
Running org.apache.wiki.plugin.RecentChangesPluginTest
Tests run: 3, Failures: 0, Errors: 0, Skipped: 0, Time elapsed: 0.071 sec - in org.apache.wiki.plugin.RecentChangesPluginTest
Running org.apache.wiki.plugin.ReferringPagesPluginTest
Tests run: 8, Failures: 0, Errors: 0, Skipped: 0, Time elapsed: 0.296 sec - in org.apache.wiki.plugin.ReferringPagesPluginTest
Running org.apache.wiki.plugin.PageViewPluginTest
Tests run: 4, Failures: 0, Errors: 0, Skipped: 0, Time elapsed: 0.095 sec - in org.apache.wiki.plugin.PageViewPluginTest
Running org.apache.wiki.plugin.TableOfContentsTest
Tests run: 8, Failures: 0, Errors: 0, Skipped: 0, Time elapsed: 0.141 sec - in org.apache.wiki.plugin.TableOfContentsTest
Running org.apache.wiki.plugin.UndefinedPagesPluginTest
Tests run: 2, Failures: 0, Errors: 0, Skipped: 0, Time elapsed: 0.035 sec - in org.apache.wiki.plugin.UndefinedPagesPluginTest
Running org.apache.wiki.plugin.InsertPageTest
Tests run: 6, Failures: 0, Errors: 0, Skipped: 0, Time elapsed: 0.106 sec - in org.apache.wiki.plugin.InsertPageTest
Running org.apache.wiki.i18n.InternationalizationManagerTest
Tests run: 2, Failures: 0, Errors: 0, Skipped: 0, Time elapsed: 0 sec - in org.apache.wiki.i18n.InternationalizationManagerTest
Running org.apache.wiki.stress.MassiveRepositoryTest
Creating 1000 pages
....................................................................................................
Took 0:00:12.788, which is 78.1983109164842 adds/second
Checking in 1000 revisions
....................................................................................................
Took 0:00:15.532, which is 64.38320885912954 adds/second
Rendering 10000 pages
....................................................................................................
Took 0:00:02.693, which is 3713.330857779428 renders/second
Tests run: 1, Failures: 0, Errors: 0, Skipped: 0, Time elapsed: 31.697 sec - in org.apache.wiki.stress.MassiveRepositoryTest
Running org.apache.wiki.search.SearchManagerTest
SearchManagerTest.waitForIndex for testTitleSearch2 sleeping 0 (out of 50)
SearchManagerTest.waitForIndex for testSimpleSearch sleeping 0 (out of 50)
SearchManagerTest.waitForIndex for testTitleSearch sleeping 0 (out of 50)
SearchManagerTest.waitForIndex for testSimpleSearch2 sleeping 0 (out of 50)
SearchManagerTest.waitForIndex for testSimpleSearch2 sleeping 1 (out of 50)
SearchManagerTest.waitForIndex for testSimpleSearch2 sleeping 2 (out of 50)
SearchManagerTest.waitForIndex for testSimpleSearch2 sleeping 3 (out of 50)
SearchManagerTest.waitForIndex for testSimpleSearch2 sleeping 4 (out of 50)
SearchManagerTest.waitForIndex for testSimpleSearch2 sleeping 5 (out of 50)
SearchManagerTest.waitForIndex for testSimpleSearch2 sleeping 6 (out of 50)
SearchManagerTest.waitForIndex for testSimpleSearch2 sleeping 7 (out of 50)
SearchManagerTest.waitForIndex for testSimpleSearch2 sleeping 8 (out of 50)
SearchManagerTest.waitForIndex for testSimpleSearch2 sleeping 9 (out of 50)
SearchManagerTest.waitForIndex for testSimpleSearch2 sleeping 10 (out of 50)
SearchManagerTest.waitForIndex for testSimpleSearch2 sleeping 11 (out of 50)
SearchManagerTest.waitForIndex for testSimpleSearch2 sleeping 12 (out of 50)
SearchManagerTest.waitForIndex for testSimpleSearch2 sleeping 13 (out of 50)
SearchManagerTest.waitForIndex for testSimpleSearch2 sleeping 14 (out of 50)
SearchManagerTest.waitForIndex for testSimpleSearch2 sleeping 15 (out of 50)
SearchManagerTest.waitForIndex for testSimpleSearch2 sleeping 16 (out of 50)
SearchManagerTest.waitForIndex for testSimpleSearch2 sleeping 17 (out of 50)
SearchManagerTest.waitForIndex for testSimpleSearch2 sleeping 18 (out of 50)
SearchManagerTest.waitForIndex for testSimpleSearch2 sleeping 19 (out of 50)
SearchManagerTest.waitForIndex for testSimpleSearch2 sleeping 20 (out of 50)
SearchManagerTest.waitForIndex for testSimpleSearch2 sleeping 21 (out of 50)
SearchManagerTest.waitForIndex for testSimpleSearch2 sleeping 22 (out of 50)
SearchManagerTest.waitForIndex for testSimpleSearch2 sleeping 23 (out of 50)
SearchManagerTest.waitForIndex for testSimpleSearch2 sleeping 24 (out of 50)
SearchManagerTest.waitForIndex for testSimpleSearch2 sleeping 25 (out of 50)
SearchManagerTest.waitForIndex for testSimpleSearch2 sleeping 26 (out of 50)
SearchManagerTest.waitForIndex for testSimpleSearch2 sleeping 27 (out of 50)
SearchManagerTest.waitForIndex for testSimpleSearch2 sleeping 28 (out of 50)
SearchManagerTest.waitForIndex for testSimpleSearch2 sleeping 29 (out of 50)
SearchManagerTest.waitForIndex for testSimpleSearch2 sleeping 30 (out of 50)
SearchManagerTest.waitForIndex for testSimpleSearch2 sleeping 31 (out of 50)
SearchManagerTest.waitForIndex for testSimpleSearch2 sleeping 32 (out of 50)
SearchManagerTest.waitForIndex for testSimpleSearch2 sleeping 33 (out of 50)
SearchManagerTest.waitForIndex for testSimpleSearch2 sleeping 34 (out of 50)
SearchManagerTest.waitForIndex for testSimpleSearch2 sleeping 35 (out of 50)
SearchManagerTest.waitForIndex for testSimpleSearch2 sleeping 36 (out of 50)
SearchManagerTest.waitForIndex for testSimpleSearch2 sleeping 37 (out of 50)
SearchManagerTest.waitForIndex for testSimpleSearch2 sleeping 38 (out of 50)
SearchManagerTest.waitForIndex for testSimpleSearch2 sleeping 39 (out of 50)
SearchManagerTest.waitForIndex for testSimpleSearch2 sleeping 40 (out of 50)
SearchManagerTest.waitForIndex for testSimpleSearch2 sleeping 41 (out of 50)
SearchManagerTest.waitForIndex for testSimpleSearch2 sleeping 42 (out of 50)
SearchManagerTest.waitForIndex for testSimpleSearch2 sleeping 43 (out of 50)
SearchManagerTest.waitForIndex for testSimpleSearch2 sleeping 44 (out of 50)
SearchManagerTest.waitForIndex for testSimpleSearch2 sleeping 45 (out of 50)
SearchManagerTest.waitForIndex for testSimpleSearch2 sleeping 46 (out of 50)
SearchManagerTest.waitForIndex for testSimpleSearch2 sleeping 47 (out of 50)
SearchManagerTest.waitForIndex for testSimpleSearch2 sleeping 48 (out of 50)
SearchManagerTest.waitForIndex for testSimpleSearch2 sleeping 49 (out of 50)
SearchManagerTest.waitForIndex for testSimpleSearch3 sleeping 0 (out of 50)
Tests run: 6, Failures: 1, Errors: 0, Skipped: 0, Time elapsed: 108.318 sec <<< FAILURE!
- in org.apache.wiki.search.SearchManagerTest
testSimpleSearch2(org.apache.wiki.search.SearchManagerTest)  Time elapsed: 100.134 sec  <<<
FAILURE!
junit.framework.AssertionFailedError: null result
	at junit.framework.Assert.fail(Assert.java:57)
	at junit.framework.Assert.assertTrue(Assert.java:22)
	at junit.framework.Assert.assertNotNull(Assert.java:256)
	at junit.framework.TestCase.assertNotNull(TestCase.java:426)
	at org.apache.wiki.search.SearchManagerTest.testSimpleSearch2(SearchManagerTest.java:120)

Running org.apache.wiki.PageManagerTest
Tests run: 2, Failures: 0, Errors: 0, Skipped: 0, Time elapsed: 0.009 sec - in org.apache.wiki.PageManagerTest
Running org.apache.wiki.rss.RSSGeneratorTest
Tests run: 2, Failures: 0, Errors: 0, Skipped: 0, Time elapsed: 0.05 sec - in org.apache.wiki.rss.RSSGeneratorTest

Results :

Failed tests: 
  SearchManagerTest.testSimpleSearch2:120 null result

Tests run: 945, Failures: 1, Errors: 0, Skipped: 0

[INFO] ------------------------------------------------------------------------
[INFO] Reactor Summary:
[INFO] 
[INFO] Apache JSPWiki .................................... SUCCESS [3.815s]
[INFO] Apache JSPWiki Main War ........................... FAILURE [4:24.288s]
[INFO] Apache JSPWiki's website .......................... SKIPPED
[INFO] jspwiki-selenium-tests ............................ SKIPPED
[INFO] jspwiki-it-builder ................................ SKIPPED
[INFO] jspwiki-it-test-custom ............................ SKIPPED
[INFO] jspwiki-it-test-custom-absolute-urls .............. SKIPPED
[INFO] jspwiki-it-test-custom-jdbc ....................... SKIPPED
[INFO] jspwiki-it-test-container ......................... SKIPPED
[INFO] jspwiki-it-test-container-jdbc .................... SKIPPED
[INFO] ------------------------------------------------------------------------
[INFO] BUILD FAILURE
[INFO] ------------------------------------------------------------------------
[INFO] Total time: 4:28.629s
[INFO] Finished at: Sun Aug 04 22:33:36 UTC 2013
[INFO] Final Memory: 30M/382M
[INFO] ------------------------------------------------------------------------
[ERROR] Failed to execute goal org.apache.maven.plugins:maven-surefire-plugin:2.15:test (default-test)
on project jspwiki-war: There are test failures.
[ERROR] 
[ERROR] Please refer to /home/hudson/jenkins-slave/workspace/JSPWiki/jspwiki-war/target/surefire-reports
for the individual test results.
[ERROR] -> [Help 1]
[ERROR] 
[ERROR] To see the full stack trace of the errors, re-run Maven with the -e switch.
[ERROR] Re-run Maven using the -X switch to enable full debug logging.
[ERROR] 
[ERROR] For more information about the errors and possible solutions, please read the following
articles:
[ERROR] [Help 1] http://cwiki.apache.org/confluence/display/MAVEN/MojoFailureException
[ERROR] 
[ERROR] After correcting the problems, you can resume the build with the command
[ERROR]   mvn <goals> -rf :jspwiki-war
Build step 'Invoke top-level Maven targets' marked build as failure

Mime
View raw message