jspwiki-commits mailing list archives

Site index · List index
Message view « Date » · « Thread »
Top « Date » · « Thread »
From Apache Jenkins Server <jenk...@builds.apache.org>
Subject Build failed in Jenkins: JSPWiki #191
Date Mon, 05 Aug 2013 22:06:35 GMT
See <https://builds.apache.org/job/JSPWiki/191/>

------------------------------------------
[...truncated 3573 lines...]
Tests run: 7, Failures: 0, Errors: 0, Skipped: 0, Time elapsed: 0.085 sec - in org.apache.wiki.workflow.DecisionQueueTest
Running org.apache.wiki.workflow.OutcomeTest
Tests run: 6, Failures: 0, Errors: 0, Skipped: 0, Time elapsed: 0.01 sec - in org.apache.wiki.workflow.OutcomeTest
Running org.apache.wiki.workflow.TaskTest
Tests run: 12, Failures: 0, Errors: 0, Skipped: 0, Time elapsed: 0.002 sec - in org.apache.wiki.workflow.TaskTest
Running org.apache.wiki.workflow.WorkflowManagerTest
Tests run: 4, Failures: 0, Errors: 0, Skipped: 0, Time elapsed: 0.035 sec - in org.apache.wiki.workflow.WorkflowManagerTest
Running org.apache.wiki.workflow.ApprovalWorkflowTest
Tests run: 5, Failures: 0, Errors: 0, Skipped: 0, Time elapsed: 0.058 sec - in org.apache.wiki.workflow.ApprovalWorkflowTest
Running org.apache.wiki.workflow.SimpleDecisionTest
Tests run: 16, Failures: 0, Errors: 0, Skipped: 0, Time elapsed: 0.003 sec - in org.apache.wiki.workflow.SimpleDecisionTest
Running org.apache.wiki.workflow.WorkflowTest
Tests run: 24, Failures: 0, Errors: 0, Skipped: 0, Time elapsed: 0.005 sec - in org.apache.wiki.workflow.WorkflowTest
Running org.apache.wiki.PageManagerTest
Tests run: 2, Failures: 0, Errors: 0, Skipped: 0, Time elapsed: 0.018 sec - in org.apache.wiki.PageManagerTest
Running org.apache.wiki.attachment.AttachmentManagerTest
Deleting <https://builds.apache.org/job/JSPWiki/ws/jspwiki-war/target/test-classes/testworkdir>
Deleting <https://builds.apache.org/job/JSPWiki/ws/jspwiki-war/target/test-classes/testworkdir>
Deleting <https://builds.apache.org/job/JSPWiki/ws/jspwiki-war/target/test-classes/testworkdir>
Deleting <https://builds.apache.org/job/JSPWiki/ws/jspwiki-war/target/test-classes/testworkdir>
Deleting <https://builds.apache.org/job/JSPWiki/ws/jspwiki-war/target/test-classes/testworkdir>
Deleting <https://builds.apache.org/job/JSPWiki/ws/jspwiki-war/target/test-classes/testworkdir>
Deleting <https://builds.apache.org/job/JSPWiki/ws/jspwiki-war/target/test-classes/testworkdir>
Deleting <https://builds.apache.org/job/JSPWiki/ws/jspwiki-war/target/test-classes/testworkdir>
Deleting <https://builds.apache.org/job/JSPWiki/ws/jspwiki-war/target/test-classes/testworkdir>
Deleting <https://builds.apache.org/job/JSPWiki/ws/jspwiki-war/target/test-classes/testworkdir>
Deleting <https://builds.apache.org/job/JSPWiki/ws/jspwiki-war/target/test-classes/testworkdir>
Deleting <https://builds.apache.org/job/JSPWiki/ws/jspwiki-war/target/test-classes/testworkdir>
Deleting <https://builds.apache.org/job/JSPWiki/ws/jspwiki-war/target/test-classes/testworkdir>
Deleting <https://builds.apache.org/job/JSPWiki/ws/jspwiki-war/target/test-classes/testworkdir>
Tests run: 14, Failures: 0, Errors: 0, Skipped: 0, Time elapsed: 0.471 sec - in org.apache.wiki.attachment.AttachmentManagerTest
Running org.apache.wiki.render.RenderingManagerTest
DOM cache speed test:
  Nocache took 0:00:00.107
  Cache took 0:00:00.007
  Approx speedup: 15x
Tests run: 1, Failures: 0, Errors: 0, Skipped: 0, Time elapsed: 0.134 sec - in org.apache.wiki.render.RenderingManagerTest
Running org.apache.wiki.render.CreoleRendererTest
Tests run: 14, Failures: 0, Errors: 0, Skipped: 0, Time elapsed: 0.174 sec - in org.apache.wiki.render.CreoleRendererTest
Running org.apache.wiki.render.WysiwygEditingRendererTest
Tests run: 2, Failures: 0, Errors: 0, Skipped: 0, Time elapsed: 0.03 sec - in org.apache.wiki.render.WysiwygEditingRendererTest
Running org.apache.wiki.ReleaseTest
Tests run: 17, Failures: 0, Errors: 0, Skipped: 0, Time elapsed: 0.003 sec - in org.apache.wiki.ReleaseTest
Running org.apache.wiki.url.DefaultURLConstructorTest
Tests run: 12, Failures: 0, Errors: 0, Skipped: 0, Time elapsed: 0.097 sec - in org.apache.wiki.url.DefaultURLConstructorTest
Running org.apache.wiki.url.ShortURLConstructorTest
Tests run: 12, Failures: 0, Errors: 0, Skipped: 0, Time elapsed: 0.096 sec - in org.apache.wiki.url.ShortURLConstructorTest
Running org.apache.wiki.url.ShortViewURLConstructorTest
Tests run: 12, Failures: 0, Errors: 0, Skipped: 0, Time elapsed: 0.108 sec - in org.apache.wiki.url.ShortViewURLConstructorTest
Running org.apache.wiki.content.PageRenamerTest
Deleting <https://builds.apache.org/job/JSPWiki/ws/jspwiki-war/target/test-classes/testworkdir>
Deleting <https://builds.apache.org/job/JSPWiki/ws/jspwiki-war/target/test-classes/testworkdir>
Deleting <https://builds.apache.org/job/JSPWiki/ws/jspwiki-war/target/test-classes/testworkdir>
Deleting <https://builds.apache.org/job/JSPWiki/ws/jspwiki-war/target/test-classes/testworkdir>
Deleting <https://builds.apache.org/job/JSPWiki/ws/jspwiki-war/target/test-classes/testworkdir>
Deleting <https://builds.apache.org/job/JSPWiki/ws/jspwiki-war/target/test-classes/testworkdir>
Deleting <https://builds.apache.org/job/JSPWiki/ws/jspwiki-war/target/test-classes/testworkdir>
Deleting <https://builds.apache.org/job/JSPWiki/ws/jspwiki-war/target/test-classes/testworkdir>
Deleting <https://builds.apache.org/job/JSPWiki/ws/jspwiki-war/target/test-classes/testworkdir>
Deleting <https://builds.apache.org/job/JSPWiki/ws/jspwiki-war/target/test-classes/testworkdir>
Deleting <https://builds.apache.org/job/JSPWiki/ws/jspwiki-war/target/test-classes/testworkdir>
Deleting <https://builds.apache.org/job/JSPWiki/ws/jspwiki-war/target/test-classes/testworkdir>
Deleting <https://builds.apache.org/job/JSPWiki/ws/jspwiki-war/target/test-classes/testworkdir>
Deleting <https://builds.apache.org/job/JSPWiki/ws/jspwiki-war/target/test-classes/testworkdir>
Deleting <https://builds.apache.org/job/JSPWiki/ws/jspwiki-war/target/test-classes/testworkdir>
Deleting <https://builds.apache.org/job/JSPWiki/ws/jspwiki-war/target/test-classes/testworkdir>
Deleting <https://builds.apache.org/job/JSPWiki/ws/jspwiki-war/target/test-classes/testworkdir>
Deleting <https://builds.apache.org/job/JSPWiki/ws/jspwiki-war/target/test-classes/testworkdir>
Deleting <https://builds.apache.org/job/JSPWiki/ws/jspwiki-war/target/test-classes/testworkdir>
Deleting <https://builds.apache.org/job/JSPWiki/ws/jspwiki-war/target/test-classes/testworkdir>
Deleting <https://builds.apache.org/job/JSPWiki/ws/jspwiki-war/target/test-classes/testworkdir>
Deleting <https://builds.apache.org/job/JSPWiki/ws/jspwiki-war/target/test-classes/testworkdir>
Tests run: 21, Failures: 0, Errors: 0, Skipped: 0, Time elapsed: 0.446 sec - in org.apache.wiki.content.PageRenamerTest
Running org.apache.wiki.PropertyReaderTest
/p/mywiki/wrk/
Tests run: 3, Failures: 0, Errors: 0, Skipped: 0, Time elapsed: 0.001 sec - in org.apache.wiki.PropertyReaderTest
Running org.apache.wiki.filters.DefaultFilterManagerTest
Tests run: 2, Failures: 0, Errors: 0, Skipped: 0, Time elapsed: 0.02 sec - in org.apache.wiki.filters.DefaultFilterManagerTest
Running org.apache.wiki.diff.ContextualDiffProviderTest
Tests run: 6, Failures: 0, Errors: 0, Skipped: 0, Time elapsed: 0.283 sec - in org.apache.wiki.diff.ContextualDiffProviderTest
Running org.apache.wiki.auth.authorize.XMLGroupDatabaseTest
Tests run: 4, Failures: 0, Errors: 0, Skipped: 0, Time elapsed: 0.046 sec - in org.apache.wiki.auth.authorize.XMLGroupDatabaseTest
Running org.apache.wiki.auth.authorize.WebContainerAuthorizerTest
Tests run: 4, Failures: 0, Errors: 0, Skipped: 0, Time elapsed: 0.047 sec - in org.apache.wiki.auth.authorize.WebContainerAuthorizerTest
Running org.apache.wiki.auth.authorize.JDBCGroupDatabaseTest
[Server@aa9567]: [Thread[main,5,main]]: setSilent(true)
[Server@b91f37]: [Thread[main,5,main]]: setSilent(true)
[Server@b748dc]: [Thread[main,5,main]]: setSilent(true)
[Server@113b29e]: [Thread[main,5,main]]: setSilent(true)
Tests run: 4, Failures: 0, Errors: 0, Skipped: 0, Time elapsed: 16.15 sec - in org.apache.wiki.auth.authorize.JDBCGroupDatabaseTest
Running org.apache.wiki.auth.authorize.GroupTest
Tests run: 8, Failures: 0, Errors: 0, Skipped: 0, Time elapsed: 0.067 sec - in org.apache.wiki.auth.authorize.GroupTest
Running org.apache.wiki.auth.acl.AclEntryImplTest
Tests run: 7, Failures: 0, Errors: 0, Skipped: 0, Time elapsed: 0.001 sec - in org.apache.wiki.auth.acl.AclEntryImplTest
Running org.apache.wiki.auth.acl.AclImplTest
Tests run: 6, Failures: 0, Errors: 0, Skipped: 0, Time elapsed: 0.08 sec - in org.apache.wiki.auth.acl.AclImplTest
Running org.apache.wiki.auth.acl.DefaultAclManagerTest
[{ALLOW view Alice}]
[{   ALLOW   view   Alice  }]
[{   ALLOW   view  Alice  ,  Bob  }]
[{   ALLOW   view  Alice  ,  Bob  }]
Tests run: 3, Failures: 0, Errors: 0, Skipped: 0, Time elapsed: 0.043 sec - in org.apache.wiki.auth.acl.DefaultAclManagerTest
Running org.apache.wiki.auth.AuthenticationManagerTest
Tests run: 6, Failures: 0, Errors: 0, Skipped: 0, Time elapsed: 0.112 sec - in org.apache.wiki.auth.AuthenticationManagerTest
Running org.apache.wiki.auth.login.UserDatabaseLoginModuleTest
Tests run: 2, Failures: 0, Errors: 0, Skipped: 0, Time elapsed: 0.025 sec - in org.apache.wiki.auth.login.UserDatabaseLoginModuleTest
Running org.apache.wiki.auth.login.WebContainerLoginModuleTest
Tests run: 2, Failures: 0, Errors: 0, Skipped: 0, Time elapsed: 0.02 sec - in org.apache.wiki.auth.login.WebContainerLoginModuleTest
Running org.apache.wiki.auth.login.CookieAssertionLoginModuleTest
Tests run: 2, Failures: 0, Errors: 0, Skipped: 0, Time elapsed: 0.019 sec - in org.apache.wiki.auth.login.CookieAssertionLoginModuleTest
Running org.apache.wiki.auth.login.AnonymousLoginModuleTest
Tests run: 2, Failures: 0, Errors: 0, Skipped: 0, Time elapsed: 0.02 sec - in org.apache.wiki.auth.login.AnonymousLoginModuleTest
Running org.apache.wiki.auth.AuthorizationManagerTest
Tests run: 17, Failures: 0, Errors: 0, Skipped: 0, Time elapsed: 0.265 sec - in org.apache.wiki.auth.AuthorizationManagerTest
Running org.apache.wiki.auth.user.XMLUserDatabaseTest
Tests run: 11, Failures: 0, Errors: 0, Skipped: 0, Time elapsed: 0.131 sec - in org.apache.wiki.auth.user.XMLUserDatabaseTest
Running org.apache.wiki.auth.user.UserProfileTest
Tests run: 5, Failures: 0, Errors: 0, Skipped: 0, Time elapsed: 0.055 sec - in org.apache.wiki.auth.user.UserProfileTest
Running org.apache.wiki.auth.user.JDBCUserDatabaseTest
[Server@78d139]: [Thread[main,5,main]]: setSilent(true)
[Server@19a42c8]: [Thread[main,5,main]]: setSilent(true)
[Server@fe50ad]: [Thread[main,5,main]]: setSilent(true)
[Server@9afa7a]: [Thread[main,5,main]]: setSilent(true)
[Server@13d3e1d]: [Thread[main,5,main]]: setSilent(true)
[Server@f67bbb]: [Thread[main,5,main]]: setSilent(true)
[Server@10c0b64]: [Thread[main,5,main]]: setSilent(true)
[Server@46338f]: [Thread[main,5,main]]: setSilent(true)
[Server@d3ba7f]: [Thread[main,5,main]]: setSilent(true)
Looks like your database could not be connected to - please make sure that you have started
your database, exception: java.sql.SQLException: java.lang.NullPointerException java.lang.NullPointerException
[Server@f93ea9]: [Thread[main,5,main]]: setSilent(true)
[Server@f93ea9]: [Thread[HSQLDB Server @f93ea9,5,main]]: run()/openServerSocket(): 
java.net.BindException: Address already in use
	at java.net.PlainSocketImpl.socketBind(Native Method)
	at java.net.PlainSocketImpl.bind(PlainSocketImpl.java:383)
	at java.net.ServerSocket.bind(ServerSocket.java:328)
	at java.net.ServerSocket.<init>(ServerSocket.java:194)
	at java.net.ServerSocket.<init>(ServerSocket.java:106)
	at org.hsqldb.server.HsqlSocketFactory.createServerSocket(Unknown Source)
	at org.hsqldb.server.Server.openServerSocket(Unknown Source)
	at org.hsqldb.server.Server.run(Unknown Source)
	at org.hsqldb.server.Server.access$000(Unknown Source)
	at org.hsqldb.server.Server$ServerThread.run(Unknown Source)
Looks like your database could not be connected to - please make sure that you have started
your database, exception: java.sql.SQLException: java.lang.NullPointerException java.lang.NullPointerException
[Server@1f1769d]: [Thread[main,5,main]]: setSilent(true)
[Server@1f1769d]: [Thread[HSQLDB Server @1f1769d,5,main]]: run()/openServerSocket(): 
java.net.BindException: Address already in use
	at java.net.PlainSocketImpl.socketBind(Native Method)
	at java.net.PlainSocketImpl.bind(PlainSocketImpl.java:383)
	at java.net.ServerSocket.bind(ServerSocket.java:328)
	at java.net.ServerSocket.<init>(ServerSocket.java:194)
	at java.net.ServerSocket.<init>(ServerSocket.java:106)
	at org.hsqldb.server.HsqlSocketFactory.createServerSocket(Unknown Source)
	at org.hsqldb.server.Server.openServerSocket(Unknown Source)
	at org.hsqldb.server.Server.run(Unknown Source)
	at org.hsqldb.server.Server.access$000(Unknown Source)
	at org.hsqldb.server.Server$ServerThread.run(Unknown Source)
Looks like your database could not be connected to - please make sure that you have started
your database, exception: java.sql.SQLException: java.lang.NullPointerException java.lang.NullPointerException
Tests run: 11, Failures: 0, Errors: 3, Skipped: 0, Time elapsed: 15.808 sec <<< FAILURE!
- in org.apache.wiki.auth.user.JDBCUserDatabaseTest
testFindByUid(org.apache.wiki.auth.user.JDBCUserDatabaseTest)  Time elapsed: 0.314 sec  <<<
ERROR!
java.sql.SQLException: java.lang.NullPointerException java.lang.NullPointerException
	at org.hsqldb.error.Error.error(Unknown Source)
	at org.hsqldb.ClientConnection.<init>(Unknown Source)
	at org.hsqldb.jdbc.JDBCConnection.<init>(Unknown Source)
	at org.hsqldb.jdbc.JDBCDriver.getConnection(Unknown Source)
	at org.hsqldb.jdbc.JDBCDriver.connect(Unknown Source)
	at org.apache.wiki.TestJDBCDataSource.getConnection(TestJDBCDataSource.java:100)
	at org.apache.wiki.TestJDBCDataSource.getConnection(TestJDBCDataSource.java:86)
	at org.apache.wiki.auth.user.JDBCUserDatabaseTest.setUp(JDBCUserDatabaseTest.java:106)

testFindByFullName(org.apache.wiki.auth.user.JDBCUserDatabaseTest)  Time elapsed: 0.305 sec
 <<< ERROR!
java.sql.SQLException: java.lang.NullPointerException java.lang.NullPointerException
	at org.hsqldb.error.Error.error(Unknown Source)
	at org.hsqldb.ClientConnection.<init>(Unknown Source)
	at org.hsqldb.jdbc.JDBCConnection.<init>(Unknown Source)
	at org.hsqldb.jdbc.JDBCDriver.getConnection(Unknown Source)
	at org.hsqldb.jdbc.JDBCDriver.connect(Unknown Source)
	at org.apache.wiki.TestJDBCDataSource.getConnection(TestJDBCDataSource.java:100)
	at org.apache.wiki.TestJDBCDataSource.getConnection(TestJDBCDataSource.java:86)
	at org.apache.wiki.auth.user.JDBCUserDatabaseTest.setUp(JDBCUserDatabaseTest.java:106)

testRename(org.apache.wiki.auth.user.JDBCUserDatabaseTest)  Time elapsed: 0.304 sec  <<<
ERROR!
java.sql.SQLException: java.lang.NullPointerException java.lang.NullPointerException
	at org.hsqldb.error.Error.error(Unknown Source)
	at org.hsqldb.ClientConnection.<init>(Unknown Source)
	at org.hsqldb.jdbc.JDBCConnection.<init>(Unknown Source)
	at org.hsqldb.jdbc.JDBCDriver.getConnection(Unknown Source)
	at org.hsqldb.jdbc.JDBCDriver.connect(Unknown Source)
	at org.apache.wiki.TestJDBCDataSource.getConnection(TestJDBCDataSource.java:100)
	at org.apache.wiki.TestJDBCDataSource.getConnection(TestJDBCDataSource.java:86)
	at org.apache.wiki.auth.user.JDBCUserDatabaseTest.setUp(JDBCUserDatabaseTest.java:106)

Running org.apache.wiki.auth.UserManagerTest
Tests run: 5, Failures: 0, Errors: 0, Skipped: 0, Time elapsed: 0.116 sec - in org.apache.wiki.auth.UserManagerTest
Running org.apache.wiki.auth.GroupManagerTest
Tests run: 4, Failures: 0, Errors: 0, Skipped: 0, Time elapsed: 0.059 sec - in org.apache.wiki.auth.GroupManagerTest
Running org.apache.wiki.auth.permissions.AllPermissionTest
Tests run: 5, Failures: 0, Errors: 0, Skipped: 0, Time elapsed: 0.001 sec - in org.apache.wiki.auth.permissions.AllPermissionTest
Running org.apache.wiki.auth.permissions.PagePermissionTest
Tests run: 10, Failures: 0, Errors: 0, Skipped: 0, Time elapsed: 0.002 sec - in org.apache.wiki.auth.permissions.PagePermissionTest
Running org.apache.wiki.auth.permissions.WikiPermissionTest
Tests run: 10, Failures: 0, Errors: 0, Skipped: 0, Time elapsed: 0.001 sec - in org.apache.wiki.auth.permissions.WikiPermissionTest
Running org.apache.wiki.auth.permissions.GroupPermissionTest
Tests run: 10, Failures: 0, Errors: 0, Skipped: 0, Time elapsed: 0.002 sec - in org.apache.wiki.auth.permissions.GroupPermissionTest
Running org.apache.wiki.auth.permissions.AllPermissionCollectionTest
Tests run: 8, Failures: 0, Errors: 0, Skipped: 0, Time elapsed: 0.002 sec - in org.apache.wiki.auth.permissions.AllPermissionCollectionTest

Results :

Tests in error: 
  JDBCUserDatabaseTest.setUp:131 SQL java.lang.NullPointerException java.lang.Nu...
  JDBCUserDatabaseTest.setUp:131 SQL java.lang.NullPointerException java.lang.Nu...
  JDBCUserDatabaseTest.setUp:131 SQL java.lang.NullPointerException java.lang.Nu...

Tests run: 945, Failures: 0, Errors: 3, Skipped: 0

[INFO] ------------------------------------------------------------------------
[INFO] Reactor Summary:
[INFO] 
[INFO] Apache JSPWiki .................................... SUCCESS [14.495s]
[INFO] Apache JSPWiki Main War ........................... FAILURE [2:53.483s]
[INFO] Apache JSPWiki's website .......................... SKIPPED
[INFO] jspwiki-selenium-tests ............................ SKIPPED
[INFO] jspwiki-it-builder ................................ SKIPPED
[INFO] jspwiki-it-test-custom ............................ SKIPPED
[INFO] jspwiki-it-test-custom-absolute-urls .............. SKIPPED
[INFO] jspwiki-it-test-custom-jdbc ....................... SKIPPED
[INFO] jspwiki-it-test-container ......................... SKIPPED
[INFO] jspwiki-it-test-container-jdbc .................... SKIPPED
[INFO] ------------------------------------------------------------------------
[INFO] BUILD FAILURE
[INFO] ------------------------------------------------------------------------
[INFO] Total time: 3:08.598s
[INFO] Finished at: Mon Aug 05 22:06:34 UTC 2013
[INFO] Final Memory: 30M/323M
[INFO] ------------------------------------------------------------------------
[ERROR] Failed to execute goal org.apache.maven.plugins:maven-surefire-plugin:2.15:test (default-test)
on project jspwiki-war: There are test failures.
[ERROR] 
[ERROR] Please refer to <https://builds.apache.org/job/JSPWiki/ws/jspwiki-war/target/surefire-reports>
for the individual test results.
[ERROR] -> [Help 1]
[ERROR] 
[ERROR] To see the full stack trace of the errors, re-run Maven with the -e switch.
[ERROR] Re-run Maven using the -X switch to enable full debug logging.
[ERROR] 
[ERROR] For more information about the errors and possible solutions, please read the following
articles:
[ERROR] [Help 1] http://cwiki.apache.org/confluence/display/MAVEN/MojoFailureException
[ERROR] 
[ERROR] After correcting the problems, you can resume the build with the command
[ERROR]   mvn <goals> -rf :jspwiki-war
Build step 'Invoke top-level Maven targets' marked build as failure

Mime
View raw message