jspwiki-commits mailing list archives

Site index · List index
Message view « Date » · « Thread »
Top « Date » · « Thread »
From Apache Jenkins Server <jenk...@builds.apache.org>
Subject Build failed in Jenkins: JSPWiki #196
Date Tue, 06 Aug 2013 08:58:20 GMT
See <https://builds.apache.org/job/JSPWiki/196/>

------------------------------------------
[...truncated 358 lines...]
Tests run: 1, Failures: 0, Errors: 0, Skipped: 0, Time elapsed: 0.001 sec - in org.apache.wiki.util.SerializerTest
Running org.apache.wiki.util.FileUtilTest
Tests run: 5, Failures: 0, Errors: 0, Skipped: 0, Time elapsed: 0.011 sec - in org.apache.wiki.util.FileUtilTest
Running org.apache.wiki.util.TextUtilTest
Tests run: 40, Failures: 0, Errors: 0, Skipped: 0, Time elapsed: 0.047 sec - in org.apache.wiki.util.TextUtilTest
Running org.apache.wiki.util.UtilJ2eeCompatTest
Tests run: 3, Failures: 0, Errors: 0, Skipped: 0, Time elapsed: 0.001 sec - in org.apache.wiki.util.UtilJ2eeCompatTest
Running org.apache.wiki.util.PageSorterTest
Tests run: 5, Failures: 0, Errors: 0, Skipped: 0, Time elapsed: 0.003 sec - in org.apache.wiki.util.PageSorterTest
Running org.apache.wiki.util.comparators.HumanComparatorTest
Tests run: 2, Failures: 0, Errors: 0, Skipped: 0, Time elapsed: 0 sec - in org.apache.wiki.util.comparators.HumanComparatorTest
Running org.apache.wiki.util.CryptoUtilTest
Tests run: 8, Failures: 0, Errors: 0, Skipped: 0, Time elapsed: 0.002 sec - in org.apache.wiki.util.CryptoUtilTest
Running org.apache.wiki.util.TimedCounterListTest
Tests run: 2, Failures: 0, Errors: 0, Skipped: 0, Time elapsed: 0.111 sec - in org.apache.wiki.util.TimedCounterListTest
Running org.apache.wiki.util.MailUtilTest
I could not test whether mail sending works, since I could not connect to your SMTP server.
Reason: Could not connect to SMTP host: 127.0.0.1, port: 25
Tests run: 2, Failures: 0, Errors: 0, Skipped: 0, Time elapsed: 0.301 sec - in org.apache.wiki.util.MailUtilTest
Running org.apache.wiki.util.ClassUtilTest
Tests run: 3, Failures: 0, Errors: 0, Skipped: 0, Time elapsed: 0.058 sec - in org.apache.wiki.util.ClassUtilTest
Running org.apache.wiki.util.CommentedPropertiesTest
Tests run: 4, Failures: 0, Errors: 0, Skipped: 0, Time elapsed: 0.003 sec - in org.apache.wiki.util.CommentedPropertiesTest
Running org.apache.wiki.util.PriorityListTest
Tests run: 4, Failures: 0, Errors: 0, Skipped: 0, Time elapsed: 0.001 sec - in org.apache.wiki.util.PriorityListTest
Running org.apache.wiki.render.RenderingManagerTest
DOM cache speed test:
  Nocache took 0:00:00.180
  Cache took 0:00:00.056
  Approx speedup: 3x
Tests run: 1, Failures: 0, Errors: 0, Skipped: 0, Time elapsed: 0.261 sec - in org.apache.wiki.render.RenderingManagerTest
Running org.apache.wiki.render.WysiwygEditingRendererTest
Tests run: 2, Failures: 0, Errors: 0, Skipped: 0, Time elapsed: 0.04 sec - in org.apache.wiki.render.WysiwygEditingRendererTest
Running org.apache.wiki.render.CreoleRendererTest
Tests run: 14, Failures: 0, Errors: 0, Skipped: 0, Time elapsed: 0.141 sec - in org.apache.wiki.render.CreoleRendererTest
Running org.apache.wiki.url.DefaultURLConstructorTest
Tests run: 12, Failures: 0, Errors: 0, Skipped: 0, Time elapsed: 0.099 sec - in org.apache.wiki.url.DefaultURLConstructorTest
Running org.apache.wiki.url.ShortViewURLConstructorTest
Tests run: 12, Failures: 0, Errors: 0, Skipped: 0, Time elapsed: 0.099 sec - in org.apache.wiki.url.ShortViewURLConstructorTest
Running org.apache.wiki.url.ShortURLConstructorTest
Tests run: 12, Failures: 0, Errors: 0, Skipped: 0, Time elapsed: 0.096 sec - in org.apache.wiki.url.ShortURLConstructorTest
Running org.apache.wiki.PropertyReaderTest
/p/mywiki/wrk/
Tests run: 3, Failures: 0, Errors: 0, Skipped: 0, Time elapsed: 0.001 sec - in org.apache.wiki.PropertyReaderTest
Running org.apache.wiki.htmltowiki.HtmlStringToWikiTranslatorTest
Tests run: 17, Failures: 0, Errors: 0, Skipped: 0, Time elapsed: 0.081 sec - in org.apache.wiki.htmltowiki.HtmlStringToWikiTranslatorTest
Running org.apache.wiki.auth.login.WebContainerLoginModuleTest
Tests run: 2, Failures: 0, Errors: 0, Skipped: 0, Time elapsed: 0.021 sec - in org.apache.wiki.auth.login.WebContainerLoginModuleTest
Running org.apache.wiki.auth.login.UserDatabaseLoginModuleTest
Tests run: 2, Failures: 0, Errors: 0, Skipped: 0, Time elapsed: 0.023 sec - in org.apache.wiki.auth.login.UserDatabaseLoginModuleTest
Running org.apache.wiki.auth.login.AnonymousLoginModuleTest
Tests run: 2, Failures: 0, Errors: 0, Skipped: 0, Time elapsed: 0.02 sec - in org.apache.wiki.auth.login.AnonymousLoginModuleTest
Running org.apache.wiki.auth.login.CookieAssertionLoginModuleTest
Tests run: 2, Failures: 0, Errors: 0, Skipped: 0, Time elapsed: 0.02 sec - in org.apache.wiki.auth.login.CookieAssertionLoginModuleTest
Running org.apache.wiki.auth.AuthorizationManagerTest
Tests run: 17, Failures: 0, Errors: 0, Skipped: 0, Time elapsed: 0.276 sec - in org.apache.wiki.auth.AuthorizationManagerTest
Running org.apache.wiki.auth.authorize.XMLGroupDatabaseTest
Tests run: 4, Failures: 0, Errors: 0, Skipped: 0, Time elapsed: 0.058 sec - in org.apache.wiki.auth.authorize.XMLGroupDatabaseTest
Running org.apache.wiki.auth.authorize.JDBCGroupDatabaseTest
[Server@1f5f74a]: [Thread[main,5,main]]: setSilent(true)
[Server@15735fd]: [Thread[main,5,main]]: setSilent(true)
[Server@6c4a07]: [Thread[main,5,main]]: setSilent(true)
[Server@1e94776]: [Thread[main,5,main]]: setSilent(true)
Tests run: 4, Failures: 0, Errors: 0, Skipped: 0, Time elapsed: 13.819 sec - in org.apache.wiki.auth.authorize.JDBCGroupDatabaseTest
Running org.apache.wiki.auth.authorize.WebContainerAuthorizerTest
Tests run: 4, Failures: 0, Errors: 0, Skipped: 0, Time elapsed: 0.066 sec - in org.apache.wiki.auth.authorize.WebContainerAuthorizerTest
Running org.apache.wiki.auth.authorize.GroupTest
Tests run: 8, Failures: 0, Errors: 0, Skipped: 0, Time elapsed: 0.088 sec - in org.apache.wiki.auth.authorize.GroupTest
Running org.apache.wiki.auth.acl.AclImplTest
Tests run: 6, Failures: 0, Errors: 0, Skipped: 0, Time elapsed: 0.087 sec - in org.apache.wiki.auth.acl.AclImplTest
Running org.apache.wiki.auth.acl.AclEntryImplTest
Tests run: 7, Failures: 0, Errors: 0, Skipped: 0, Time elapsed: 0 sec - in org.apache.wiki.auth.acl.AclEntryImplTest
Running org.apache.wiki.auth.acl.DefaultAclManagerTest
[{ALLOW view Alice}]
[{   ALLOW   view   Alice  }]
[{   ALLOW   view  Alice  ,  Bob  }]
[{   ALLOW   view  Alice  ,  Bob  }]
Tests run: 3, Failures: 0, Errors: 0, Skipped: 0, Time elapsed: 0.049 sec - in org.apache.wiki.auth.acl.DefaultAclManagerTest
Running org.apache.wiki.auth.GroupManagerTest
Tests run: 4, Failures: 0, Errors: 0, Skipped: 0, Time elapsed: 0.061 sec - in org.apache.wiki.auth.GroupManagerTest
Running org.apache.wiki.auth.UserManagerTest
Tests run: 5, Failures: 0, Errors: 0, Skipped: 0, Time elapsed: 0.114 sec - in org.apache.wiki.auth.UserManagerTest
Running org.apache.wiki.auth.user.JDBCUserDatabaseTest
[Server@dced2]: [Thread[main,5,main]]: setSilent(true)
[Server@19f9377]: [Thread[main,5,main]]: setSilent(true)
[Server@1aa167a]: [Thread[main,5,main]]: setSilent(true)
[Server@10e73e0]: [Thread[main,5,main]]: setSilent(true)
[Server@15facb0]: [Thread[main,5,main]]: setSilent(true)
[Server@1b2cb94]: [Thread[main,5,main]]: setSilent(true)
[Server@1a3310a]: [Thread[main,5,main]]: setSilent(true)
[Server@1b6f0eb]: [Thread[main,5,main]]: setSilent(true)
[Server@13b23d6]: [Thread[main,5,main]]: setSilent(true)
[Server@53f6e6]: [Thread[main,5,main]]: setSilent(true)
[Server@61db97]: [Thread[main,5,main]]: setSilent(true)
Tests run: 11, Failures: 0, Errors: 0, Skipped: 0, Time elapsed: 20.133 sec - in org.apache.wiki.auth.user.JDBCUserDatabaseTest
Running org.apache.wiki.auth.user.XMLUserDatabaseTest
Tests run: 11, Failures: 0, Errors: 0, Skipped: 0, Time elapsed: 0.12 sec - in org.apache.wiki.auth.user.XMLUserDatabaseTest
Running org.apache.wiki.auth.user.UserProfileTest
Tests run: 5, Failures: 0, Errors: 0, Skipped: 0, Time elapsed: 0.055 sec - in org.apache.wiki.auth.user.UserProfileTest
Running org.apache.wiki.auth.permissions.AllPermissionTest
Tests run: 5, Failures: 0, Errors: 0, Skipped: 0, Time elapsed: 0 sec - in org.apache.wiki.auth.permissions.AllPermissionTest
Running org.apache.wiki.auth.permissions.PagePermissionTest
Tests run: 10, Failures: 0, Errors: 0, Skipped: 0, Time elapsed: 0.002 sec - in org.apache.wiki.auth.permissions.PagePermissionTest
Running org.apache.wiki.auth.permissions.GroupPermissionTest
Tests run: 10, Failures: 0, Errors: 0, Skipped: 0, Time elapsed: 0.003 sec - in org.apache.wiki.auth.permissions.GroupPermissionTest
Running org.apache.wiki.auth.permissions.WikiPermissionTest
Tests run: 10, Failures: 0, Errors: 0, Skipped: 0, Time elapsed: 0.001 sec - in org.apache.wiki.auth.permissions.WikiPermissionTest
Running org.apache.wiki.auth.permissions.AllPermissionCollectionTest
Tests run: 8, Failures: 0, Errors: 0, Skipped: 0, Time elapsed: 0.002 sec - in org.apache.wiki.auth.permissions.AllPermissionCollectionTest
Running org.apache.wiki.auth.AuthenticationManagerTest
Tests run: 6, Failures: 0, Errors: 0, Skipped: 0, Time elapsed: 0.104 sec - in org.apache.wiki.auth.AuthenticationManagerTest
Running org.apache.wiki.attachment.AttachmentManagerTest
Deleting <https://builds.apache.org/job/JSPWiki/ws/jspwiki-war/target/test-classes/testworkdir>
Deleting <https://builds.apache.org/job/JSPWiki/ws/jspwiki-war/target/test-classes/testworkdir>
Deleting <https://builds.apache.org/job/JSPWiki/ws/jspwiki-war/target/test-classes/testworkdir>
Deleting <https://builds.apache.org/job/JSPWiki/ws/jspwiki-war/target/test-classes/testworkdir>
Deleting <https://builds.apache.org/job/JSPWiki/ws/jspwiki-war/target/test-classes/testworkdir>
Deleting <https://builds.apache.org/job/JSPWiki/ws/jspwiki-war/target/test-classes/testworkdir>
Deleting <https://builds.apache.org/job/JSPWiki/ws/jspwiki-war/target/test-classes/testworkdir>
Deleting <https://builds.apache.org/job/JSPWiki/ws/jspwiki-war/target/test-classes/testworkdir>
Deleting <https://builds.apache.org/job/JSPWiki/ws/jspwiki-war/target/test-classes/testworkdir>
Deleting <https://builds.apache.org/job/JSPWiki/ws/jspwiki-war/target/test-classes/testworkdir>
Deleting <https://builds.apache.org/job/JSPWiki/ws/jspwiki-war/target/test-classes/testworkdir>
Deleting <https://builds.apache.org/job/JSPWiki/ws/jspwiki-war/target/test-classes/testworkdir>
Deleting <https://builds.apache.org/job/JSPWiki/ws/jspwiki-war/target/test-classes/testworkdir>
Deleting <https://builds.apache.org/job/JSPWiki/ws/jspwiki-war/target/test-classes/testworkdir>
Tests run: 14, Failures: 0, Errors: 0, Skipped: 0, Time elapsed: 0.241 sec - in org.apache.wiki.attachment.AttachmentManagerTest
Running org.apache.wiki.workflow.DecisionQueueTest
Tests run: 7, Failures: 0, Errors: 0, Skipped: 0, Time elapsed: 0.08 sec - in org.apache.wiki.workflow.DecisionQueueTest
Running org.apache.wiki.workflow.OutcomeTest
Tests run: 6, Failures: 0, Errors: 0, Skipped: 0, Time elapsed: 0.009 sec - in org.apache.wiki.workflow.OutcomeTest
Running org.apache.wiki.workflow.SimpleDecisionTest
Tests run: 16, Failures: 0, Errors: 0, Skipped: 0, Time elapsed: 0.002 sec - in org.apache.wiki.workflow.SimpleDecisionTest
Running org.apache.wiki.workflow.TaskTest
Tests run: 12, Failures: 0, Errors: 0, Skipped: 0, Time elapsed: 0.002 sec - in org.apache.wiki.workflow.TaskTest
Running org.apache.wiki.workflow.FactTest
Tests run: 1, Failures: 0, Errors: 0, Skipped: 0, Time elapsed: 0 sec - in org.apache.wiki.workflow.FactTest
Running org.apache.wiki.workflow.WorkflowManagerTest
Tests run: 4, Failures: 0, Errors: 0, Skipped: 0, Time elapsed: 0.036 sec - in org.apache.wiki.workflow.WorkflowManagerTest
Running org.apache.wiki.workflow.ApprovalWorkflowTest
Tests run: 5, Failures: 0, Errors: 0, Skipped: 0, Time elapsed: 0.057 sec - in org.apache.wiki.workflow.ApprovalWorkflowTest
Running org.apache.wiki.workflow.WorkflowTest
Tests run: 24, Failures: 0, Errors: 0, Skipped: 0, Time elapsed: 0.004 sec - in org.apache.wiki.workflow.WorkflowTest
Running org.apache.wiki.stress.MassiveRepositoryTest
Creating 1000 pages
....................................................................................................
Took 0:00:07.700, which is 129.87012987012986 adds/second
Checking in 1000 revisions
....................................................................................................
Took 0:00:13.164, which is 75.96475235490732 adds/second
Rendering 10000 pages
....................................................................................................
Took 0:00:02.363, which is 4231.908590774439 renders/second
Tests run: 1, Failures: 0, Errors: 0, Skipped: 0, Time elapsed: 23.502 sec - in org.apache.wiki.stress.MassiveRepositoryTest
Running org.apache.wiki.filters.DefaultFilterManagerTest
Tests run: 2, Failures: 0, Errors: 0, Skipped: 0, Time elapsed: 0.042 sec - in org.apache.wiki.filters.DefaultFilterManagerTest
Running org.apache.wiki.providers.FileSystemProviderTest
Tests run: 9, Failures: 0, Errors: 0, Skipped: 0, Time elapsed: 0.166 sec - in org.apache.wiki.providers.FileSystemProviderTest
Running org.apache.wiki.providers.VersioningFileProviderTest
Tests run: 15, Failures: 0, Errors: 0, Skipped: 0, Time elapsed: 1.326 sec - in org.apache.wiki.providers.VersioningFileProviderTest
Running org.apache.wiki.providers.RCSFileProviderTest
Tests run: 8, Failures: 0, Errors: 0, Skipped: 0, Time elapsed: 0.148 sec - in org.apache.wiki.providers.RCSFileProviderTest
Running org.apache.wiki.providers.BasicAttachmentProviderTest
Deleting <https://builds.apache.org/job/JSPWiki/ws/jspwiki-war/target/test-classes/testworkdir>
Deleting <https://builds.apache.org/job/JSPWiki/ws/jspwiki-war/target/test-classes/testworkdir>
Deleting <https://builds.apache.org/job/JSPWiki/ws/jspwiki-war/target/test-classes/testworkdir>
Deleting <https://builds.apache.org/job/JSPWiki/ws/jspwiki-war/target/test-classes/testworkdir>
Deleting <https://builds.apache.org/job/JSPWiki/ws/jspwiki-war/target/test-classes/testworkdir>
Deleting <https://builds.apache.org/job/JSPWiki/ws/jspwiki-war/target/test-classes/testworkdir>
Deleting <https://builds.apache.org/job/JSPWiki/ws/jspwiki-war/target/test-classes/testworkdir>
Deleting <https://builds.apache.org/job/JSPWiki/ws/jspwiki-war/target/test-classes/testworkdir>
Deleting <https://builds.apache.org/job/JSPWiki/ws/jspwiki-war/target/test-classes/testworkdir>
Deleting <https://builds.apache.org/job/JSPWiki/ws/jspwiki-war/target/test-classes/testworkdir>
Deleting <https://builds.apache.org/job/JSPWiki/ws/jspwiki-war/target/test-classes/testworkdir>
Deleting <https://builds.apache.org/job/JSPWiki/ws/jspwiki-war/target/test-classes/testworkdir>
Tests run: 12, Failures: 0, Errors: 0, Skipped: 0, Time elapsed: 10.228 sec - in org.apache.wiki.providers.BasicAttachmentProviderTest
Running org.apache.wiki.providers.CachingProviderTest
Deleting <https://builds.apache.org/job/JSPWiki/ws/jspwiki-war/target/test-classes/testworkdir>
Deleting <https://builds.apache.org/job/JSPWiki/ws/jspwiki-war/target/test-classes/testworkdir>
Tests run: 2, Failures: 0, Errors: 0, Skipped: 0, Time elapsed: 4.045 sec - in org.apache.wiki.providers.CachingProviderTest
Running org.apache.wiki.ReferenceManagerTest
Tests run: 18, Failures: 0, Errors: 0, Skipped: 0, Time elapsed: 0.29 sec - in org.apache.wiki.ReferenceManagerTest
Running org.apache.wiki.content.PageRenamerTest
Deleting <https://builds.apache.org/job/JSPWiki/ws/jspwiki-war/target/test-classes/testworkdir>
Deleting <https://builds.apache.org/job/JSPWiki/ws/jspwiki-war/target/test-classes/testworkdir>
Deleting <https://builds.apache.org/job/JSPWiki/ws/jspwiki-war/target/test-classes/testworkdir>
Deleting <https://builds.apache.org/job/JSPWiki/ws/jspwiki-war/target/test-classes/testworkdir>
Deleting <https://builds.apache.org/job/JSPWiki/ws/jspwiki-war/target/test-classes/testworkdir>
Deleting <https://builds.apache.org/job/JSPWiki/ws/jspwiki-war/target/test-classes/testworkdir>
Deleting <https://builds.apache.org/job/JSPWiki/ws/jspwiki-war/target/test-classes/testworkdir>
Deleting <https://builds.apache.org/job/JSPWiki/ws/jspwiki-war/target/test-classes/testworkdir>
Deleting <https://builds.apache.org/job/JSPWiki/ws/jspwiki-war/target/test-classes/testworkdir>
Deleting <https://builds.apache.org/job/JSPWiki/ws/jspwiki-war/target/test-classes/testworkdir>
Deleting <https://builds.apache.org/job/JSPWiki/ws/jspwiki-war/target/test-classes/testworkdir>
Deleting <https://builds.apache.org/job/JSPWiki/ws/jspwiki-war/target/test-classes/testworkdir>
Deleting <https://builds.apache.org/job/JSPWiki/ws/jspwiki-war/target/test-classes/testworkdir>
Deleting <https://builds.apache.org/job/JSPWiki/ws/jspwiki-war/target/test-classes/testworkdir>
Deleting <https://builds.apache.org/job/JSPWiki/ws/jspwiki-war/target/test-classes/testworkdir>
Deleting <https://builds.apache.org/job/JSPWiki/ws/jspwiki-war/target/test-classes/testworkdir>
Deleting <https://builds.apache.org/job/JSPWiki/ws/jspwiki-war/target/test-classes/testworkdir>
Deleting <https://builds.apache.org/job/JSPWiki/ws/jspwiki-war/target/test-classes/testworkdir>
Deleting <https://builds.apache.org/job/JSPWiki/ws/jspwiki-war/target/test-classes/testworkdir>
Deleting <https://builds.apache.org/job/JSPWiki/ws/jspwiki-war/target/test-classes/testworkdir>
Deleting <https://builds.apache.org/job/JSPWiki/ws/jspwiki-war/target/test-classes/testworkdir>
Deleting <https://builds.apache.org/job/JSPWiki/ws/jspwiki-war/target/test-classes/testworkdir>
Tests run: 21, Failures: 0, Errors: 0, Skipped: 0, Time elapsed: 0.404 sec - in org.apache.wiki.content.PageRenamerTest

Results :

Failed tests: 
  SearchManagerTest.testTitleSearch2:182 no pages expected:<1> but was:<3>
  SearchManagerTest.testTitleSearch:167 no pages expected:<1> but was:<3>

Tests run: 945, Failures: 2, Errors: 0, Skipped: 0

[INFO] ------------------------------------------------------------------------
[INFO] Reactor Summary:
[INFO] 
[INFO] Apache JSPWiki .................................... SUCCESS [8.579s]
[INFO] Apache JSPWiki Main War ........................... FAILURE [2:39.982s]
[INFO] Apache JSPWiki's website .......................... SKIPPED
[INFO] jspwiki-selenium-tests ............................ SKIPPED
[INFO] jspwiki-it-builder ................................ SKIPPED
[INFO] jspwiki-it-test-custom ............................ SKIPPED
[INFO] jspwiki-it-test-custom-absolute-urls .............. SKIPPED
[INFO] jspwiki-it-test-custom-jdbc ....................... SKIPPED
[INFO] jspwiki-it-test-container ......................... SKIPPED
[INFO] jspwiki-it-test-container-jdbc .................... SKIPPED
[INFO] ------------------------------------------------------------------------
[INFO] BUILD FAILURE
[INFO] ------------------------------------------------------------------------
[INFO] Total time: 2:49.126s
[INFO] Finished at: Tue Aug 06 08:58:20 UTC 2013
[INFO] Final Memory: 30M/385M
[INFO] ------------------------------------------------------------------------
[ERROR] Failed to execute goal org.apache.maven.plugins:maven-surefire-plugin:2.15:test (default-test)
on project jspwiki-war: There are test failures.
[ERROR] 
[ERROR] Please refer to <https://builds.apache.org/job/JSPWiki/ws/jspwiki-war/target/surefire-reports>
for the individual test results.
[ERROR] -> [Help 1]
[ERROR] 
[ERROR] To see the full stack trace of the errors, re-run Maven with the -e switch.
[ERROR] Re-run Maven using the -X switch to enable full debug logging.
[ERROR] 
[ERROR] For more information about the errors and possible solutions, please read the following
articles:
[ERROR] [Help 1] http://cwiki.apache.org/confluence/display/MAVEN/MojoFailureException
[ERROR] 
[ERROR] After correcting the problems, you can resume the build with the command
[ERROR]   mvn <goals> -rf :jspwiki-war
Build step 'Invoke top-level Maven targets' marked build as failure

Mime
View raw message