jspwiki-commits mailing list archives

Site index · List index
Message view « Date » · « Thread »
Top « Date » · « Thread »
From Apache Jenkins Server <jenk...@builds.apache.org>
Subject Build failed in Jenkins: JSPWiki #172
Date Sat, 03 Aug 2013 14:07:19 GMT
See <https://builds.apache.org/job/JSPWiki/172/changes>

Changes:

[metskem] 2013-08-03  Harry Metske (metskem@apache.org)

       * 2.10.0-svn-30

       * fixed JSPWIKI-789 upgrade commons-io from 1.4 to 2.4

[metskem] 2013-08-03  Harry Metske (metskem@apache.org)

       * 2.10.0-svn-29

       * fixed JSPWIKI-790 upgrade HSQLDB from 2.2.9 to 2.3.0

------------------------------------------
[...truncated 653 lines...]
Running org.apache.wiki.ui.InputValidatorTest
Tests run: 4, Failures: 0, Errors: 0, Skipped: 0, Time elapsed: 0.052 sec - in org.apache.wiki.ui.InputValidatorTest
Running org.apache.wiki.ui.CommandResolverTest
Tests run: 6, Failures: 0, Errors: 0, Skipped: 0, Time elapsed: 0.126 sec - in org.apache.wiki.ui.CommandResolverTest
Running org.apache.wiki.ui.WikiCommandTest
Tests run: 2, Failures: 0, Errors: 0, Skipped: 0, Time elapsed: 0.032 sec - in org.apache.wiki.ui.WikiCommandTest
Running org.apache.wiki.parser.MarkupParserTest
Tests run: 3, Failures: 0, Errors: 0, Skipped: 0, Time elapsed: 0 sec - in org.apache.wiki.parser.MarkupParserTest
Running org.apache.wiki.parser.JSPWikiMarkupParserTest
Trying to crash parser with a line which is 198002 chars in size
100 page renderings: 0:00:00.159 (628.9308176100628 renderings/second)
Tests run: 205, Failures: 0, Errors: 0, Skipped: 0, Time elapsed: 3.894 sec - in org.apache.wiki.parser.JSPWikiMarkupParserTest
Running org.apache.wiki.parser.CreoleToJSPWikiTranslatorTest
Tests run: 84, Failures: 0, Errors: 0, Skipped: 0, Time elapsed: 0.188 sec - in org.apache.wiki.parser.CreoleToJSPWikiTranslatorTest
Running org.apache.wiki.search.SearchManagerTest
Tests run: 6, Failures: 2, Errors: 0, Skipped: 0, Time elapsed: 12.834 sec <<< FAILURE!
- in org.apache.wiki.search.SearchManagerTest
testTitleSearch2(org.apache.wiki.search.SearchManagerTest)  Time elapsed: 1.168 sec  <<<
FAILURE!
junit.framework.AssertionFailedError: no pages expected:<1> but was:<3>
	at junit.framework.Assert.fail(Assert.java:57)
	at junit.framework.Assert.failNotEquals(Assert.java:329)
	at junit.framework.Assert.assertEquals(Assert.java:78)
	at junit.framework.Assert.assertEquals(Assert.java:234)
	at junit.framework.TestCase.assertEquals(TestCase.java:401)
	at org.apache.wiki.search.SearchManagerTest.testTitleSearch2(SearchManagerTest.java:182)

testTitleSearch(org.apache.wiki.search.SearchManagerTest)  Time elapsed: 0.221 sec  <<<
FAILURE!
junit.framework.AssertionFailedError: no pages expected:<1> but was:<3>
	at junit.framework.Assert.fail(Assert.java:57)
	at junit.framework.Assert.failNotEquals(Assert.java:329)
	at junit.framework.Assert.assertEquals(Assert.java:78)
	at junit.framework.Assert.assertEquals(Assert.java:234)
	at junit.framework.TestCase.assertEquals(TestCase.java:401)
	at org.apache.wiki.search.SearchManagerTest.testTitleSearch(SearchManagerTest.java:165)

Running org.apache.wiki.xmlrpc.RPCHandlerTest
Real: Sat Aug 03 14:05:40 UTC 2013
RPC:  Sat Aug 03 14:05:40 UTC 2013
RPC2: Sat Aug 03 14:05:40 UTC 2013
Tests run: 6, Failures: 0, Errors: 0, Skipped: 0, Time elapsed: 0.099 sec - in org.apache.wiki.xmlrpc.RPCHandlerTest
Running org.apache.wiki.WikiEngineTest
Tests run: 43, Failures: 0, Errors: 0, Skipped: 0, Time elapsed: 18.834 sec - in org.apache.wiki.WikiEngineTest
Running org.apache.wiki.VariableManagerTest
Tests run: 12, Failures: 0, Errors: 0, Skipped: 0, Time elapsed: 0.124 sec - in org.apache.wiki.VariableManagerTest
Running org.apache.wiki.ReleaseTest
Tests run: 17, Failures: 0, Errors: 0, Skipped: 0, Time elapsed: 0.003 sec - in org.apache.wiki.ReleaseTest
Running org.apache.wiki.i18n.InternationalizationManagerTest
Tests run: 2, Failures: 0, Errors: 0, Skipped: 0, Time elapsed: 0.002 sec - in org.apache.wiki.i18n.InternationalizationManagerTest
Running org.apache.wiki.WikiSessionTest
Tests run: 7, Failures: 0, Errors: 0, Skipped: 0, Time elapsed: 0.106 sec - in org.apache.wiki.WikiSessionTest
Running org.apache.wiki.util.SerializerTest
Tests run: 1, Failures: 0, Errors: 0, Skipped: 0, Time elapsed: 0 sec - in org.apache.wiki.util.SerializerTest
Running org.apache.wiki.util.FileUtilTest
Tests run: 5, Failures: 0, Errors: 0, Skipped: 0, Time elapsed: 0.027 sec - in org.apache.wiki.util.FileUtilTest
Running org.apache.wiki.util.TextUtilTest
Tests run: 40, Failures: 0, Errors: 0, Skipped: 0, Time elapsed: 0.053 sec - in org.apache.wiki.util.TextUtilTest
Running org.apache.wiki.util.UtilJ2eeCompatTest
Tests run: 3, Failures: 0, Errors: 0, Skipped: 0, Time elapsed: 0 sec - in org.apache.wiki.util.UtilJ2eeCompatTest
Running org.apache.wiki.util.PageSorterTest
Tests run: 5, Failures: 0, Errors: 0, Skipped: 0, Time elapsed: 0.003 sec - in org.apache.wiki.util.PageSorterTest
Running org.apache.wiki.util.comparators.HumanComparatorTest
Tests run: 2, Failures: 0, Errors: 0, Skipped: 0, Time elapsed: 0.001 sec - in org.apache.wiki.util.comparators.HumanComparatorTest
Running org.apache.wiki.util.CryptoUtilTest
Tests run: 8, Failures: 0, Errors: 0, Skipped: 0, Time elapsed: 0.002 sec - in org.apache.wiki.util.CryptoUtilTest
Running org.apache.wiki.util.TimedCounterListTest
Tests run: 2, Failures: 0, Errors: 0, Skipped: 0, Time elapsed: 0.111 sec - in org.apache.wiki.util.TimedCounterListTest
Running org.apache.wiki.util.MailUtilTest
I could not test whether mail sending works, since I could not connect to your SMTP server.
Reason: Could not connect to SMTP host: 127.0.0.1, port: 25
Tests run: 2, Failures: 0, Errors: 0, Skipped: 0, Time elapsed: 0.347 sec - in org.apache.wiki.util.MailUtilTest
Running org.apache.wiki.util.ClassUtilTest
Tests run: 3, Failures: 0, Errors: 0, Skipped: 0, Time elapsed: 0.072 sec - in org.apache.wiki.util.ClassUtilTest
Running org.apache.wiki.util.CommentedPropertiesTest
Tests run: 4, Failures: 0, Errors: 0, Skipped: 0, Time elapsed: 0.003 sec - in org.apache.wiki.util.CommentedPropertiesTest
Running org.apache.wiki.util.PriorityListTest
Tests run: 4, Failures: 0, Errors: 0, Skipped: 0, Time elapsed: 0.001 sec - in org.apache.wiki.util.PriorityListTest
Running org.apache.wiki.render.RenderingManagerTest
DOM cache speed test:
  Nocache took 0:00:00.166
  Cache took 0:00:00.009
  Approx speedup: 18x
Tests run: 1, Failures: 0, Errors: 0, Skipped: 0, Time elapsed: 0.198 sec - in org.apache.wiki.render.RenderingManagerTest
Running org.apache.wiki.render.WysiwygEditingRendererTest
Tests run: 2, Failures: 0, Errors: 0, Skipped: 0, Time elapsed: 0.036 sec - in org.apache.wiki.render.WysiwygEditingRendererTest
Running org.apache.wiki.render.CreoleRendererTest
Tests run: 14, Failures: 0, Errors: 0, Skipped: 0, Time elapsed: 0.147 sec - in org.apache.wiki.render.CreoleRendererTest
Running org.apache.wiki.url.DefaultURLConstructorTest
Tests run: 12, Failures: 0, Errors: 0, Skipped: 0, Time elapsed: 0.103 sec - in org.apache.wiki.url.DefaultURLConstructorTest
Running org.apache.wiki.url.ShortViewURLConstructorTest
Tests run: 12, Failures: 0, Errors: 0, Skipped: 0, Time elapsed: 0.103 sec - in org.apache.wiki.url.ShortViewURLConstructorTest
Running org.apache.wiki.url.ShortURLConstructorTest
Tests run: 12, Failures: 0, Errors: 0, Skipped: 0, Time elapsed: 0.105 sec - in org.apache.wiki.url.ShortURLConstructorTest
Running org.apache.wiki.PropertyReaderTest
/p/mywiki/wrk/
Tests run: 3, Failures: 0, Errors: 0, Skipped: 0, Time elapsed: 0.002 sec - in org.apache.wiki.PropertyReaderTest
Running org.apache.wiki.htmltowiki.HtmlStringToWikiTranslatorTest
Tests run: 17, Failures: 0, Errors: 0, Skipped: 0, Time elapsed: 0.085 sec - in org.apache.wiki.htmltowiki.HtmlStringToWikiTranslatorTest
Running org.apache.wiki.auth.login.WebContainerLoginModuleTest
Tests run: 2, Failures: 0, Errors: 0, Skipped: 0, Time elapsed: 0.022 sec - in org.apache.wiki.auth.login.WebContainerLoginModuleTest
Running org.apache.wiki.auth.login.UserDatabaseLoginModuleTest
Tests run: 2, Failures: 0, Errors: 0, Skipped: 0, Time elapsed: 0.025 sec - in org.apache.wiki.auth.login.UserDatabaseLoginModuleTest
Running org.apache.wiki.auth.login.AnonymousLoginModuleTest
Tests run: 2, Failures: 0, Errors: 0, Skipped: 0, Time elapsed: 0.022 sec - in org.apache.wiki.auth.login.AnonymousLoginModuleTest
Running org.apache.wiki.auth.login.CookieAssertionLoginModuleTest
Tests run: 2, Failures: 0, Errors: 0, Skipped: 0, Time elapsed: 0.022 sec - in org.apache.wiki.auth.login.CookieAssertionLoginModuleTest
Running org.apache.wiki.auth.AuthorizationManagerTest
Tests run: 17, Failures: 0, Errors: 0, Skipped: 0, Time elapsed: 0.329 sec - in org.apache.wiki.auth.AuthorizationManagerTest
Running org.apache.wiki.auth.authorize.XMLGroupDatabaseTest
Tests run: 4, Failures: 0, Errors: 0, Skipped: 0, Time elapsed: 0.06 sec - in org.apache.wiki.auth.authorize.XMLGroupDatabaseTest
Running org.apache.wiki.auth.authorize.JDBCGroupDatabaseTest
[Server@12b25db]: [Thread[main,5,main]]: setSilent(true)
[Server@508b0e]: [Thread[main,5,main]]: setSilent(true)
[Server@9300bf]: [Thread[main,5,main]]: setSilent(true)
[Server@2fdf53]: [Thread[main,5,main]]: setSilent(true)
Tests run: 4, Failures: 0, Errors: 0, Skipped: 0, Time elapsed: 14.775 sec - in org.apache.wiki.auth.authorize.JDBCGroupDatabaseTest
Running org.apache.wiki.auth.authorize.WebContainerAuthorizerTest
Tests run: 4, Failures: 0, Errors: 0, Skipped: 0, Time elapsed: 0.069 sec - in org.apache.wiki.auth.authorize.WebContainerAuthorizerTest
Running org.apache.wiki.auth.authorize.GroupTest
Tests run: 8, Failures: 0, Errors: 0, Skipped: 0, Time elapsed: 0.093 sec - in org.apache.wiki.auth.authorize.GroupTest
Running org.apache.wiki.auth.acl.AclImplTest
Tests run: 6, Failures: 0, Errors: 0, Skipped: 0, Time elapsed: 0.091 sec - in org.apache.wiki.auth.acl.AclImplTest
Running org.apache.wiki.auth.acl.AclEntryImplTest
Tests run: 7, Failures: 0, Errors: 0, Skipped: 0, Time elapsed: 0 sec - in org.apache.wiki.auth.acl.AclEntryImplTest
Running org.apache.wiki.auth.acl.DefaultAclManagerTest
[{ALLOW view Alice}]
[{   ALLOW   view   Alice  }]
[{   ALLOW   view  Alice  ,  Bob  }]
[{   ALLOW   view  Alice  ,  Bob  }]
Tests run: 3, Failures: 0, Errors: 0, Skipped: 0, Time elapsed: 0.053 sec - in org.apache.wiki.auth.acl.DefaultAclManagerTest
Running org.apache.wiki.auth.GroupManagerTest
Tests run: 4, Failures: 0, Errors: 0, Skipped: 0, Time elapsed: 0.068 sec - in org.apache.wiki.auth.GroupManagerTest
Running org.apache.wiki.auth.UserManagerTest
Tests run: 5, Failures: 0, Errors: 0, Skipped: 0, Time elapsed: 0.124 sec - in org.apache.wiki.auth.UserManagerTest
Running org.apache.wiki.auth.user.JDBCUserDatabaseTest
[Server@510e91]: [Thread[main,5,main]]: setSilent(true)
[Server@15773de]: [Thread[main,5,main]]: setSilent(true)
[Server@1c8a9a0]: [Thread[main,5,main]]: setSilent(true)
[Server@755f8e]: [Thread[main,5,main]]: setSilent(true)
[Server@1a524a7]: [Thread[main,5,main]]: setSilent(true)
[Server@e61eb5]: [Thread[main,5,main]]: setSilent(true)
[Server@1ab6600]: [Thread[main,5,main]]: setSilent(true)
[Server@1bafdb4]: [Thread[main,5,main]]: setSilent(true)
[Server@6a2d75]: [Thread[main,5,main]]: setSilent(true)
[Server@a66e3f]: [Thread[main,5,main]]: setSilent(true)
[Server@40b778]: [Thread[main,5,main]]: setSilent(true)
Tests run: 11, Failures: 0, Errors: 0, Skipped: 0, Time elapsed: 21.798 sec - in org.apache.wiki.auth.user.JDBCUserDatabaseTest
Running org.apache.wiki.auth.user.XMLUserDatabaseTest
Tests run: 11, Failures: 0, Errors: 0, Skipped: 0, Time elapsed: 0.129 sec - in org.apache.wiki.auth.user.XMLUserDatabaseTest
Running org.apache.wiki.auth.user.UserProfileTest
Tests run: 5, Failures: 0, Errors: 0, Skipped: 0, Time elapsed: 0.061 sec - in org.apache.wiki.auth.user.UserProfileTest
Running org.apache.wiki.auth.permissions.AllPermissionTest
Tests run: 5, Failures: 0, Errors: 0, Skipped: 0, Time elapsed: 0.001 sec - in org.apache.wiki.auth.permissions.AllPermissionTest
Running org.apache.wiki.auth.permissions.PagePermissionTest
Tests run: 10, Failures: 0, Errors: 0, Skipped: 0, Time elapsed: 0.002 sec - in org.apache.wiki.auth.permissions.PagePermissionTest
Running org.apache.wiki.auth.permissions.GroupPermissionTest
Tests run: 10, Failures: 0, Errors: 0, Skipped: 0, Time elapsed: 0.003 sec - in org.apache.wiki.auth.permissions.GroupPermissionTest
Running org.apache.wiki.auth.permissions.WikiPermissionTest
Tests run: 10, Failures: 0, Errors: 0, Skipped: 0, Time elapsed: 0.002 sec - in org.apache.wiki.auth.permissions.WikiPermissionTest
Running org.apache.wiki.auth.permissions.AllPermissionCollectionTest
Tests run: 8, Failures: 0, Errors: 0, Skipped: 0, Time elapsed: 0.002 sec - in org.apache.wiki.auth.permissions.AllPermissionCollectionTest
Running org.apache.wiki.auth.AuthenticationManagerTest
Tests run: 6, Failures: 0, Errors: 0, Skipped: 0, Time elapsed: 0.11 sec - in org.apache.wiki.auth.AuthenticationManagerTest
Running org.apache.wiki.attachment.AttachmentManagerTest
Tests run: 14, Failures: 0, Errors: 0, Skipped: 0, Time elapsed: 0.249 sec - in org.apache.wiki.attachment.AttachmentManagerTest
Running org.apache.wiki.workflow.DecisionQueueTest
Tests run: 7, Failures: 0, Errors: 0, Skipped: 0, Time elapsed: 0.085 sec - in org.apache.wiki.workflow.DecisionQueueTest
Running org.apache.wiki.workflow.OutcomeTest
Tests run: 6, Failures: 0, Errors: 0, Skipped: 0, Time elapsed: 0.009 sec - in org.apache.wiki.workflow.OutcomeTest
Running org.apache.wiki.workflow.SimpleDecisionTest
Tests run: 16, Failures: 0, Errors: 0, Skipped: 0, Time elapsed: 0.002 sec - in org.apache.wiki.workflow.SimpleDecisionTest
Running org.apache.wiki.workflow.TaskTest
Tests run: 12, Failures: 0, Errors: 0, Skipped: 0, Time elapsed: 0.002 sec - in org.apache.wiki.workflow.TaskTest
Running org.apache.wiki.workflow.FactTest
Tests run: 1, Failures: 0, Errors: 0, Skipped: 0, Time elapsed: 0 sec - in org.apache.wiki.workflow.FactTest
Running org.apache.wiki.workflow.WorkflowManagerTest
Tests run: 4, Failures: 0, Errors: 0, Skipped: 0, Time elapsed: 0.037 sec - in org.apache.wiki.workflow.WorkflowManagerTest
Running org.apache.wiki.workflow.ApprovalWorkflowTest
Tests run: 5, Failures: 0, Errors: 0, Skipped: 0, Time elapsed: 0.065 sec - in org.apache.wiki.workflow.ApprovalWorkflowTest
Running org.apache.wiki.workflow.WorkflowTest
Tests run: 24, Failures: 0, Errors: 0, Skipped: 0, Time elapsed: 0.005 sec - in org.apache.wiki.workflow.WorkflowTest
Running org.apache.wiki.stress.MassiveRepositoryTest
Creating 1000 pages
....................................................................................................
Took 0:00:08.219, which is 121.66930283489475 adds/second
Checking in 1000 revisions
....................................................................................................
Took 0:00:11.802, which is 84.7314014573801 adds/second
Rendering 10000 pages
....................................................................................................
Took 0:00:02.343, which is 4268.032437046521 renders/second
Tests run: 1, Failures: 0, Errors: 0, Skipped: 0, Time elapsed: 22.638 sec - in org.apache.wiki.stress.MassiveRepositoryTest
Running org.apache.wiki.filters.DefaultFilterManagerTest
Tests run: 2, Failures: 0, Errors: 0, Skipped: 0, Time elapsed: 0.041 sec - in org.apache.wiki.filters.DefaultFilterManagerTest
Running org.apache.wiki.providers.FileSystemProviderTest
Tests run: 9, Failures: 0, Errors: 0, Skipped: 0, Time elapsed: 0.13 sec - in org.apache.wiki.providers.FileSystemProviderTest
Running org.apache.wiki.providers.VersioningFileProviderTest
Tests run: 15, Failures: 0, Errors: 0, Skipped: 0, Time elapsed: 1.461 sec - in org.apache.wiki.providers.VersioningFileProviderTest
Running org.apache.wiki.providers.RCSFileProviderTest
Tests run: 8, Failures: 0, Errors: 0, Skipped: 0, Time elapsed: 0.149 sec - in org.apache.wiki.providers.RCSFileProviderTest
Running org.apache.wiki.providers.BasicAttachmentProviderTest
Tests run: 12, Failures: 0, Errors: 0, Skipped: 0, Time elapsed: 10.207 sec - in org.apache.wiki.providers.BasicAttachmentProviderTest
Running org.apache.wiki.providers.CachingProviderTest
Tests run: 2, Failures: 0, Errors: 0, Skipped: 0, Time elapsed: 4.045 sec - in org.apache.wiki.providers.CachingProviderTest
Running org.apache.wiki.ReferenceManagerTest
Tests run: 18, Failures: 0, Errors: 0, Skipped: 0, Time elapsed: 0.357 sec - in org.apache.wiki.ReferenceManagerTest
Running org.apache.wiki.content.PageRenamerTest
Tests run: 21, Failures: 0, Errors: 0, Skipped: 0, Time elapsed: 0.405 sec - in org.apache.wiki.content.PageRenamerTest

Results :

Failed tests: 
  SearchManagerTest.testTitleSearch2:182 no pages expected:<1> but was:<3>
  SearchManagerTest.testTitleSearch:165 no pages expected:<1> but was:<3>

Tests run: 945, Failures: 2, Errors: 0, Skipped: 0

[INFO] ------------------------------------------------------------------------
[INFO] Reactor Summary:
[INFO] 
[INFO] Apache JSPWiki .................................... SUCCESS [13.823s]
[INFO] Apache JSPWiki Main War ........................... FAILURE [2:59.461s]
[INFO] Apache JSPWiki's website .......................... SKIPPED
[INFO] jspwiki-selenium-tests ............................ SKIPPED
[INFO] jspwiki-it-builder ................................ SKIPPED
[INFO] jspwiki-it-test-custom ............................ SKIPPED
[INFO] jspwiki-it-test-custom-absolute-urls .............. SKIPPED
[INFO] jspwiki-it-test-custom-jdbc ....................... SKIPPED
[INFO] jspwiki-it-test-container ......................... SKIPPED
[INFO] jspwiki-it-test-container-jdbc .................... SKIPPED
[INFO] ------------------------------------------------------------------------
[INFO] BUILD FAILURE
[INFO] ------------------------------------------------------------------------
[INFO] Total time: 3:13.965s
[INFO] Finished at: Sat Aug 03 14:07:18 UTC 2013
[INFO] Final Memory: 29M/329M
[INFO] ------------------------------------------------------------------------
[ERROR] Failed to execute goal org.apache.maven.plugins:maven-surefire-plugin:2.15:test (default-test)
on project jspwiki-war: There are test failures.
[ERROR] 
[ERROR] Please refer to <https://builds.apache.org/job/JSPWiki/ws/jspwiki-war/target/surefire-reports>
for the individual test results.
[ERROR] -> [Help 1]
[ERROR] 
[ERROR] To see the full stack trace of the errors, re-run Maven with the -e switch.
[ERROR] Re-run Maven using the -X switch to enable full debug logging.
[ERROR] 
[ERROR] For more information about the errors and possible solutions, please read the following
articles:
[ERROR] [Help 1] http://cwiki.apache.org/confluence/display/MAVEN/MojoFailureException
[ERROR] 
[ERROR] After correcting the problems, you can resume the build with the command
[ERROR]   mvn <goals> -rf :jspwiki-war
Build step 'Invoke top-level Maven targets' marked build as failure

Mime
View raw message