jspwiki-commits mailing list archives

Site index · List index
Message view « Date » · « Thread »
Top « Date » · « Thread »
From Apache Jenkins Server <jenk...@builds.apache.org>
Subject Build failed in Jenkins: JSPWiki #177
Date Sun, 04 Aug 2013 15:04:37 GMT
See <https://builds.apache.org/job/JSPWiki/177/changes>

Changes:

[metskem] more JSPWIKI-799...

------------------------------------------
[...truncated 300 lines...]
Tests run: 4, Failures: 0, Errors: 0, Skipped: 0, Time elapsed: 14.288 sec - in org.apache.wiki.auth.authorize.JDBCGroupDatabaseTest
Running org.apache.wiki.auth.authorize.GroupTest
Tests run: 8, Failures: 0, Errors: 0, Skipped: 0, Time elapsed: 0.095 sec - in org.apache.wiki.auth.authorize.GroupTest
Running org.apache.wiki.auth.authorize.XMLGroupDatabaseTest
Tests run: 4, Failures: 0, Errors: 0, Skipped: 0, Time elapsed: 0.066 sec - in org.apache.wiki.auth.authorize.XMLGroupDatabaseTest
Running org.apache.wiki.auth.user.JDBCUserDatabaseTest
[Server@14f6322]: [Thread[main,5,main]]: setSilent(true)
[Server@f1e6e4]: [Thread[main,5,main]]: setSilent(true)
[Server@2975fa]: [Thread[main,5,main]]: setSilent(true)
[Server@48c46b]: [Thread[main,5,main]]: setSilent(true)
[Server@1704006]: [Thread[main,5,main]]: setSilent(true)
[Server@15660c3]: [Thread[main,5,main]]: setSilent(true)
[Server@16a15c5]: [Thread[main,5,main]]: setSilent(true)
[Server@19bade4]: [Thread[main,5,main]]: setSilent(true)
[Server@16eb78b]: [Thread[main,5,main]]: setSilent(true)
Looks like your database could not be connected to - please make sure that you have started
your database, exception: java.sql.SQLException: java.lang.NullPointerException java.lang.NullPointerException
[Server@1428e24]: [Thread[main,5,main]]: setSilent(true)
[Server@1428e24]: [Thread[HSQLDB Server @1428e24,5,main]]: run()/openServerSocket(): 
java.net.BindException: Address already in use
	at java.net.PlainSocketImpl.socketBind(Native Method)
	at java.net.PlainSocketImpl.bind(PlainSocketImpl.java:383)
	at java.net.ServerSocket.bind(ServerSocket.java:328)
	at java.net.ServerSocket.<init>(ServerSocket.java:194)
	at java.net.ServerSocket.<init>(ServerSocket.java:106)
	at org.hsqldb.server.HsqlSocketFactory.createServerSocket(Unknown Source)
	at org.hsqldb.server.Server.openServerSocket(Unknown Source)
	at org.hsqldb.server.Server.run(Unknown Source)
	at org.hsqldb.server.Server.access$000(Unknown Source)
	at org.hsqldb.server.Server$ServerThread.run(Unknown Source)
Looks like your database could not be connected to - please make sure that you have started
your database, exception: java.sql.SQLException: java.lang.NullPointerException java.lang.NullPointerException
[Server@163cf5d]: [Thread[main,5,main]]: setSilent(true)
[Server@163cf5d]: [Thread[HSQLDB Server @163cf5d,5,main]]: run()/openServerSocket(): 
java.net.BindException: Address already in use
	at java.net.PlainSocketImpl.socketBind(Native Method)
	at java.net.PlainSocketImpl.bind(PlainSocketImpl.java:383)
	at java.net.ServerSocket.bind(ServerSocket.java:328)
	at java.net.ServerSocket.<init>(ServerSocket.java:194)
	at java.net.ServerSocket.<init>(ServerSocket.java:106)
	at org.hsqldb.server.HsqlSocketFactory.createServerSocket(Unknown Source)
	at org.hsqldb.server.Server.openServerSocket(Unknown Source)
	at org.hsqldb.server.Server.run(Unknown Source)
	at org.hsqldb.server.Server.access$000(Unknown Source)
	at org.hsqldb.server.Server$ServerThread.run(Unknown Source)
Looks like your database could not be connected to - please make sure that you have started
your database, exception: java.sql.SQLException: java.lang.NullPointerException java.lang.NullPointerException
Tests run: 11, Failures: 0, Errors: 3, Skipped: 0, Time elapsed: 15.376 sec <<< FAILURE!
- in org.apache.wiki.auth.user.JDBCUserDatabaseTest
testFindByUid(org.apache.wiki.auth.user.JDBCUserDatabaseTest)  Time elapsed: 0.316 sec  <<<
ERROR!
java.sql.SQLException: java.lang.NullPointerException java.lang.NullPointerException
	at org.hsqldb.error.Error.error(Unknown Source)
	at org.hsqldb.ClientConnection.<init>(Unknown Source)
	at org.hsqldb.jdbc.JDBCConnection.<init>(Unknown Source)
	at org.hsqldb.jdbc.JDBCDriver.getConnection(Unknown Source)
	at org.hsqldb.jdbc.JDBCDriver.connect(Unknown Source)
	at org.apache.wiki.TestJDBCDataSource.getConnection(TestJDBCDataSource.java:100)
	at org.apache.wiki.TestJDBCDataSource.getConnection(TestJDBCDataSource.java:86)
	at org.apache.wiki.auth.user.JDBCUserDatabaseTest.setUp(JDBCUserDatabaseTest.java:106)

testFindByFullName(org.apache.wiki.auth.user.JDBCUserDatabaseTest)  Time elapsed: 0.302 sec
 <<< ERROR!
java.sql.SQLException: java.lang.NullPointerException java.lang.NullPointerException
	at org.hsqldb.error.Error.error(Unknown Source)
	at org.hsqldb.ClientConnection.<init>(Unknown Source)
	at org.hsqldb.jdbc.JDBCConnection.<init>(Unknown Source)
	at org.hsqldb.jdbc.JDBCDriver.getConnection(Unknown Source)
	at org.hsqldb.jdbc.JDBCDriver.connect(Unknown Source)
	at org.apache.wiki.TestJDBCDataSource.getConnection(TestJDBCDataSource.java:100)
	at org.apache.wiki.TestJDBCDataSource.getConnection(TestJDBCDataSource.java:86)
	at org.apache.wiki.auth.user.JDBCUserDatabaseTest.setUp(JDBCUserDatabaseTest.java:106)

testRename(org.apache.wiki.auth.user.JDBCUserDatabaseTest)  Time elapsed: 0.302 sec  <<<
ERROR!
java.sql.SQLException: java.lang.NullPointerException java.lang.NullPointerException
	at org.hsqldb.error.Error.error(Unknown Source)
	at org.hsqldb.ClientConnection.<init>(Unknown Source)
	at org.hsqldb.jdbc.JDBCConnection.<init>(Unknown Source)
	at org.hsqldb.jdbc.JDBCDriver.getConnection(Unknown Source)
	at org.hsqldb.jdbc.JDBCDriver.connect(Unknown Source)
	at org.apache.wiki.TestJDBCDataSource.getConnection(TestJDBCDataSource.java:100)
	at org.apache.wiki.TestJDBCDataSource.getConnection(TestJDBCDataSource.java:86)
	at org.apache.wiki.auth.user.JDBCUserDatabaseTest.setUp(JDBCUserDatabaseTest.java:106)

Running org.apache.wiki.auth.user.XMLUserDatabaseTest
Tests run: 11, Failures: 0, Errors: 0, Skipped: 0, Time elapsed: 0.145 sec - in org.apache.wiki.auth.user.XMLUserDatabaseTest
Running org.apache.wiki.auth.user.UserProfileTest
Tests run: 5, Failures: 0, Errors: 0, Skipped: 0, Time elapsed: 0.064 sec - in org.apache.wiki.auth.user.UserProfileTest
Running org.apache.wiki.render.RenderingManagerTest
DOM cache speed test:
  Nocache took 0:00:00.139
  Cache took 0:00:00.009
  Approx speedup: 15x
Tests run: 1, Failures: 0, Errors: 0, Skipped: 0, Time elapsed: 0.171 sec - in org.apache.wiki.render.RenderingManagerTest
Running org.apache.wiki.render.CreoleRendererTest
Tests run: 14, Failures: 0, Errors: 0, Skipped: 0, Time elapsed: 0.182 sec - in org.apache.wiki.render.CreoleRendererTest
Running org.apache.wiki.render.WysiwygEditingRendererTest
Tests run: 2, Failures: 0, Errors: 0, Skipped: 0, Time elapsed: 0.041 sec - in org.apache.wiki.render.WysiwygEditingRendererTest
Running org.apache.wiki.content.PageRenamerTest
Tests run: 21, Failures: 0, Errors: 0, Skipped: 0, Time elapsed: 0.59 sec - in org.apache.wiki.content.PageRenamerTest
Running org.apache.wiki.xmlrpc.RPCHandlerTest
Real: Sun Aug 04 15:02:54 UTC 2013
RPC:  Sun Aug 04 15:02:54 UTC 2013
RPC2: Sun Aug 04 15:02:54 UTC 2013
Tests run: 6, Failures: 0, Errors: 0, Skipped: 0, Time elapsed: 0.106 sec - in org.apache.wiki.xmlrpc.RPCHandlerTest
Running org.apache.wiki.WikiEngineTest
Tests run: 43, Failures: 0, Errors: 0, Skipped: 0, Time elapsed: 18.639 sec - in org.apache.wiki.WikiEngineTest
Running org.apache.wiki.filters.DefaultFilterManagerTest
Tests run: 2, Failures: 0, Errors: 0, Skipped: 0, Time elapsed: 0.019 sec - in org.apache.wiki.filters.DefaultFilterManagerTest
Running org.apache.wiki.ReferenceManagerTest
Tests run: 18, Failures: 0, Errors: 0, Skipped: 0, Time elapsed: 0.348 sec - in org.apache.wiki.ReferenceManagerTest
Running org.apache.wiki.util.ClassUtilTest
Tests run: 3, Failures: 0, Errors: 0, Skipped: 0, Time elapsed: 0.054 sec - in org.apache.wiki.util.ClassUtilTest
Running org.apache.wiki.util.PageSorterTest
Tests run: 5, Failures: 0, Errors: 0, Skipped: 0, Time elapsed: 0.003 sec - in org.apache.wiki.util.PageSorterTest
Running org.apache.wiki.util.TextUtilTest
Tests run: 40, Failures: 0, Errors: 0, Skipped: 0, Time elapsed: 0.042 sec - in org.apache.wiki.util.TextUtilTest
Running org.apache.wiki.util.FileUtilTest
Tests run: 5, Failures: 0, Errors: 0, Skipped: 0, Time elapsed: 0.007 sec - in org.apache.wiki.util.FileUtilTest
Running org.apache.wiki.util.CryptoUtilTest
Tests run: 8, Failures: 0, Errors: 0, Skipped: 0, Time elapsed: 0.001 sec - in org.apache.wiki.util.CryptoUtilTest
Running org.apache.wiki.util.MailUtilTest
Tests run: 2, Failures: 0, Errors: 0, Skipped: 0, Time elapsed: 0.095 sec - in org.apache.wiki.util.MailUtilTest
Running org.apache.wiki.util.SerializerTest
Tests run: 1, Failures: 0, Errors: 0, Skipped: 0, Time elapsed: 0.001 sec - in org.apache.wiki.util.SerializerTest
Running org.apache.wiki.util.PriorityListTest
Tests run: 4, Failures: 0, Errors: 0, Skipped: 0, Time elapsed: 0.001 sec - in org.apache.wiki.util.PriorityListTest
Running org.apache.wiki.util.CommentedPropertiesTest
Tests run: 4, Failures: 0, Errors: 0, Skipped: 0, Time elapsed: 0.003 sec - in org.apache.wiki.util.CommentedPropertiesTest
Running org.apache.wiki.util.comparators.HumanComparatorTest
Tests run: 2, Failures: 0, Errors: 0, Skipped: 0, Time elapsed: 0.001 sec - in org.apache.wiki.util.comparators.HumanComparatorTest
Running org.apache.wiki.util.UtilJ2eeCompatTest
Tests run: 3, Failures: 0, Errors: 0, Skipped: 0, Time elapsed: 0.001 sec - in org.apache.wiki.util.UtilJ2eeCompatTest
Running org.apache.wiki.util.TimedCounterListTest
Tests run: 2, Failures: 0, Errors: 0, Skipped: 0, Time elapsed: 0.111 sec - in org.apache.wiki.util.TimedCounterListTest
Running org.apache.wiki.htmltowiki.HtmlStringToWikiTranslatorTest
Tests run: 17, Failures: 0, Errors: 0, Skipped: 0, Time elapsed: 0.083 sec - in org.apache.wiki.htmltowiki.HtmlStringToWikiTranslatorTest
Running org.apache.wiki.plugin.GroupsTest
Tests run: 1, Failures: 0, Errors: 0, Skipped: 0, Time elapsed: 0.016 sec - in org.apache.wiki.plugin.GroupsTest
Running org.apache.wiki.plugin.IfPluginTest
Tests run: 4, Failures: 0, Errors: 0, Skipped: 0, Time elapsed: 0.061 sec - in org.apache.wiki.plugin.IfPluginTest
Running org.apache.wiki.plugin.CounterPluginTest
Tests run: 6, Failures: 0, Errors: 0, Skipped: 0, Time elapsed: 0.069 sec - in org.apache.wiki.plugin.CounterPluginTest
Running org.apache.wiki.plugin.DefaultPluginManagerTest
Tests run: 15, Failures: 0, Errors: 0, Skipped: 0, Time elapsed: 0.162 sec - in org.apache.wiki.plugin.DefaultPluginManagerTest
Running org.apache.wiki.plugin.RecentChangesPluginTest
Tests run: 3, Failures: 0, Errors: 0, Skipped: 0, Time elapsed: 0.071 sec - in org.apache.wiki.plugin.RecentChangesPluginTest
Running org.apache.wiki.plugin.ReferringPagesPluginTest
Tests run: 8, Failures: 0, Errors: 0, Skipped: 0, Time elapsed: 1.043 sec - in org.apache.wiki.plugin.ReferringPagesPluginTest
Running org.apache.wiki.plugin.PageViewPluginTest
Tests run: 4, Failures: 0, Errors: 0, Skipped: 0, Time elapsed: 0.432 sec - in org.apache.wiki.plugin.PageViewPluginTest
Running org.apache.wiki.plugin.TableOfContentsTest
Tests run: 8, Failures: 0, Errors: 0, Skipped: 0, Time elapsed: 0.191 sec - in org.apache.wiki.plugin.TableOfContentsTest
Running org.apache.wiki.plugin.UndefinedPagesPluginTest
Tests run: 2, Failures: 0, Errors: 0, Skipped: 0, Time elapsed: 0.088 sec - in org.apache.wiki.plugin.UndefinedPagesPluginTest
Running org.apache.wiki.plugin.InsertPageTest
Tests run: 6, Failures: 0, Errors: 0, Skipped: 0, Time elapsed: 0.162 sec - in org.apache.wiki.plugin.InsertPageTest
Running org.apache.wiki.i18n.InternationalizationManagerTest
Tests run: 2, Failures: 0, Errors: 0, Skipped: 0, Time elapsed: 0 sec - in org.apache.wiki.i18n.InternationalizationManagerTest
Running org.apache.wiki.stress.MassiveRepositoryTest
Creating 1000 pages
....................................................................................................
Took 0:00:17.418, which is 57.41187277528993 adds/second
Checking in 1000 revisions
....................................................................................................
Took 0:00:25.833, which is 38.71017690550846 adds/second
Rendering 10000 pages
....................................................................................................
Took 0:00:02.573, which is 3886.5137971239797 renders/second
Tests run: 1, Failures: 0, Errors: 0, Skipped: 0, Time elapsed: 55.98 sec - in org.apache.wiki.stress.MassiveRepositoryTest
Running org.apache.wiki.search.SearchManagerTest
SearchManagerTest.waitForIndex for testTitleSearch2 sleeping (Thread Thread[main,5,main])
0 (out of 20)
SearchManagerTest.waitForIndex for testSimpleSearch sleeping (Thread Thread[main,5,main])
0 (out of 20)
SearchManagerTest.waitForIndex for testTitleSearch sleeping (Thread Thread[main,5,main]) 0
(out of 20)
SearchManagerTest.waitForIndex for testSimpleSearch2 sleeping (Thread Thread[main,5,main])
0 (out of 20)
SearchManagerTest.waitForIndex for testSimpleSearch2 sleeping (Thread Thread[main,5,main])
1 (out of 20)
SearchManagerTest.waitForIndex for testSimpleSearch2 sleeping (Thread Thread[main,5,main])
2 (out of 20)
SearchManagerTest.waitForIndex for testSimpleSearch2 sleeping (Thread Thread[main,5,main])
3 (out of 20)
SearchManagerTest.waitForIndex for testSimpleSearch2 sleeping (Thread Thread[main,5,main])
4 (out of 20)
SearchManagerTest.waitForIndex for testSimpleSearch2 sleeping (Thread Thread[main,5,main])
5 (out of 20)
SearchManagerTest.waitForIndex for testSimpleSearch2 sleeping (Thread Thread[main,5,main])
6 (out of 20)
SearchManagerTest.waitForIndex for testSimpleSearch2 sleeping (Thread Thread[main,5,main])
7 (out of 20)
SearchManagerTest.waitForIndex for testSimpleSearch2 sleeping (Thread Thread[main,5,main])
8 (out of 20)
SearchManagerTest.waitForIndex for testSimpleSearch2 sleeping (Thread Thread[main,5,main])
9 (out of 20)
SearchManagerTest.waitForIndex for testSimpleSearch2 sleeping (Thread Thread[main,5,main])
10 (out of 20)
SearchManagerTest.waitForIndex for testSimpleSearch2 sleeping (Thread Thread[main,5,main])
11 (out of 20)
SearchManagerTest.waitForIndex for testSimpleSearch2 sleeping (Thread Thread[main,5,main])
12 (out of 20)
SearchManagerTest.waitForIndex for testSimpleSearch2 sleeping (Thread Thread[main,5,main])
13 (out of 20)
SearchManagerTest.waitForIndex for testSimpleSearch2 sleeping (Thread Thread[main,5,main])
14 (out of 20)
SearchManagerTest.waitForIndex for testSimpleSearch2 sleeping (Thread Thread[main,5,main])
15 (out of 20)
SearchManagerTest.waitForIndex for testSimpleSearch2 sleeping (Thread Thread[main,5,main])
16 (out of 20)
SearchManagerTest.waitForIndex for testSimpleSearch2 sleeping (Thread Thread[main,5,main])
17 (out of 20)
SearchManagerTest.waitForIndex for testSimpleSearch2 sleeping (Thread Thread[main,5,main])
18 (out of 20)
SearchManagerTest.waitForIndex for testSimpleSearch2 sleeping (Thread Thread[main,5,main])
19 (out of 20)
SearchManagerTest.waitForIndex for testSimpleSearch3 sleeping (Thread Thread[main,5,main])
0 (out of 20)
Tests run: 6, Failures: 1, Errors: 0, Skipped: 0, Time elapsed: 24.283 sec <<< FAILURE!
- in org.apache.wiki.search.SearchManagerTest
testSimpleSearch2(org.apache.wiki.search.SearchManagerTest)  Time elapsed: 20.105 sec  <<<
FAILURE!
junit.framework.AssertionFailedError: null result
	at junit.framework.Assert.fail(Assert.java:57)
	at junit.framework.Assert.assertTrue(Assert.java:22)
	at junit.framework.Assert.assertNotNull(Assert.java:256)
	at junit.framework.TestCase.assertNotNull(TestCase.java:426)
	at org.apache.wiki.search.SearchManagerTest.testSimpleSearch2(SearchManagerTest.java:120)

Running org.apache.wiki.PageManagerTest
Tests run: 2, Failures: 0, Errors: 0, Skipped: 0, Time elapsed: 0.032 sec - in org.apache.wiki.PageManagerTest
Running org.apache.wiki.rss.RSSGeneratorTest
Tests run: 2, Failures: 0, Errors: 0, Skipped: 0, Time elapsed: 0.267 sec - in org.apache.wiki.rss.RSSGeneratorTest

Results :

Failed tests: 
  SearchManagerTest.testSimpleSearch2:120 null result

Tests in error: 
  JDBCUserDatabaseTest.setUp:131 SQL java.lang.NullPointerException java.lang.Nu...
  JDBCUserDatabaseTest.setUp:131 SQL java.lang.NullPointerException java.lang.Nu...
  JDBCUserDatabaseTest.setUp:131 SQL java.lang.NullPointerException java.lang.Nu...

Tests run: 945, Failures: 1, Errors: 3, Skipped: 0

[INFO] ------------------------------------------------------------------------
[INFO] Reactor Summary:
[INFO] 
[INFO] Apache JSPWiki .................................... SUCCESS [2.648s]
[INFO] Apache JSPWiki Main War ........................... FAILURE [3:15.830s]
[INFO] Apache JSPWiki's website .......................... SKIPPED
[INFO] jspwiki-selenium-tests ............................ SKIPPED
[INFO] jspwiki-it-builder ................................ SKIPPED
[INFO] jspwiki-it-test-custom ............................ SKIPPED
[INFO] jspwiki-it-test-custom-absolute-urls .............. SKIPPED
[INFO] jspwiki-it-test-custom-jdbc ....................... SKIPPED
[INFO] jspwiki-it-test-container ......................... SKIPPED
[INFO] jspwiki-it-test-container-jdbc .................... SKIPPED
[INFO] ------------------------------------------------------------------------
[INFO] BUILD FAILURE
[INFO] ------------------------------------------------------------------------
[INFO] Total time: 3:18.980s
[INFO] Finished at: Sun Aug 04 15:04:36 UTC 2013
[INFO] Final Memory: 30M/384M
[INFO] ------------------------------------------------------------------------
[ERROR] Failed to execute goal org.apache.maven.plugins:maven-surefire-plugin:2.15:test (default-test)
on project jspwiki-war: There are test failures.
[ERROR] 
[ERROR] Please refer to /home/hudson/jenkins-slave/workspace/JSPWiki/jspwiki-war/target/surefire-reports
for the individual test results.
[ERROR] -> [Help 1]
[ERROR] 
[ERROR] To see the full stack trace of the errors, re-run Maven with the -e switch.
[ERROR] Re-run Maven using the -X switch to enable full debug logging.
[ERROR] 
[ERROR] For more information about the errors and possible solutions, please read the following
articles:
[ERROR] [Help 1] http://cwiki.apache.org/confluence/display/MAVEN/MojoFailureException
[ERROR] 
[ERROR] After correcting the problems, you can resume the build with the command
[ERROR]   mvn <goals> -rf :jspwiki-war
Build step 'Invoke top-level Maven targets' marked build as failure

Mime
View raw message