jspwiki-commits mailing list archives

Site index · List index
Message view « Date » · « Thread »
Top « Date » · « Thread »
From Apache Jenkins Server <jenk...@builds.apache.org>
Subject Build failed in Jenkins: JSPWiki #178
Date Sun, 04 Aug 2013 16:09:30 GMT
See <https://builds.apache.org/job/JSPWiki/178/changes>

Changes:

[metskem] more JSPWIKI-799, increase waittime

------------------------------------------
[...truncated 938 lines...]
testGetWikiName(org.apache.wiki.auth.user.JDBCUserDatabaseTest)  Time elapsed: 0.306 sec 
<<< ERROR!
java.sql.SQLException: java.lang.NullPointerException java.lang.NullPointerException
	at org.hsqldb.error.Error.error(Unknown Source)
	at org.hsqldb.ClientConnection.<init>(Unknown Source)
	at org.hsqldb.jdbc.JDBCConnection.<init>(Unknown Source)
	at org.hsqldb.jdbc.JDBCDriver.getConnection(Unknown Source)
	at org.hsqldb.jdbc.JDBCDriver.connect(Unknown Source)
	at org.apache.wiki.TestJDBCDataSource.getConnection(TestJDBCDataSource.java:100)
	at org.apache.wiki.TestJDBCDataSource.getConnection(TestJDBCDataSource.java:86)
	at org.apache.wiki.auth.user.JDBCUserDatabaseTest.setUp(JDBCUserDatabaseTest.java:106)

testFindByEmail(org.apache.wiki.auth.user.JDBCUserDatabaseTest)  Time elapsed: 0.304 sec 
<<< ERROR!
java.sql.SQLException: java.lang.NullPointerException java.lang.NullPointerException
	at org.hsqldb.error.Error.error(Unknown Source)
	at org.hsqldb.ClientConnection.<init>(Unknown Source)
	at org.hsqldb.jdbc.JDBCConnection.<init>(Unknown Source)
	at org.hsqldb.jdbc.JDBCDriver.getConnection(Unknown Source)
	at org.hsqldb.jdbc.JDBCDriver.connect(Unknown Source)
	at org.apache.wiki.TestJDBCDataSource.getConnection(TestJDBCDataSource.java:100)
	at org.apache.wiki.TestJDBCDataSource.getConnection(TestJDBCDataSource.java:86)
	at org.apache.wiki.auth.user.JDBCUserDatabaseTest.setUp(JDBCUserDatabaseTest.java:106)

testFindByUid(org.apache.wiki.auth.user.JDBCUserDatabaseTest)  Time elapsed: 0.305 sec  <<<
ERROR!
java.sql.SQLException: java.lang.NullPointerException java.lang.NullPointerException
	at org.hsqldb.error.Error.error(Unknown Source)
	at org.hsqldb.ClientConnection.<init>(Unknown Source)
	at org.hsqldb.jdbc.JDBCConnection.<init>(Unknown Source)
	at org.hsqldb.jdbc.JDBCDriver.getConnection(Unknown Source)
	at org.hsqldb.jdbc.JDBCDriver.connect(Unknown Source)
	at org.apache.wiki.TestJDBCDataSource.getConnection(TestJDBCDataSource.java:100)
	at org.apache.wiki.TestJDBCDataSource.getConnection(TestJDBCDataSource.java:86)
	at org.apache.wiki.auth.user.JDBCUserDatabaseTest.setUp(JDBCUserDatabaseTest.java:106)

testFindByFullName(org.apache.wiki.auth.user.JDBCUserDatabaseTest)  Time elapsed: 0.307 sec
 <<< ERROR!
java.sql.SQLException: java.lang.NullPointerException java.lang.NullPointerException
	at org.hsqldb.error.Error.error(Unknown Source)
	at org.hsqldb.ClientConnection.<init>(Unknown Source)
	at org.hsqldb.jdbc.JDBCConnection.<init>(Unknown Source)
	at org.hsqldb.jdbc.JDBCDriver.getConnection(Unknown Source)
	at org.hsqldb.jdbc.JDBCDriver.connect(Unknown Source)
	at org.apache.wiki.TestJDBCDataSource.getConnection(TestJDBCDataSource.java:100)
	at org.apache.wiki.TestJDBCDataSource.getConnection(TestJDBCDataSource.java:86)
	at org.apache.wiki.auth.user.JDBCUserDatabaseTest.setUp(JDBCUserDatabaseTest.java:106)

testRename(org.apache.wiki.auth.user.JDBCUserDatabaseTest)  Time elapsed: 0.306 sec  <<<
ERROR!
java.sql.SQLException: java.lang.NullPointerException java.lang.NullPointerException
	at org.hsqldb.error.Error.error(Unknown Source)
	at org.hsqldb.ClientConnection.<init>(Unknown Source)
	at org.hsqldb.jdbc.JDBCConnection.<init>(Unknown Source)
	at org.hsqldb.jdbc.JDBCDriver.getConnection(Unknown Source)
	at org.hsqldb.jdbc.JDBCDriver.connect(Unknown Source)
	at org.apache.wiki.TestJDBCDataSource.getConnection(TestJDBCDataSource.java:100)
	at org.apache.wiki.TestJDBCDataSource.getConnection(TestJDBCDataSource.java:86)
	at org.apache.wiki.auth.user.JDBCUserDatabaseTest.setUp(JDBCUserDatabaseTest.java:106)

Running org.apache.wiki.auth.user.XMLUserDatabaseTest
Tests run: 11, Failures: 0, Errors: 0, Skipped: 0, Time elapsed: 0.179 sec - in org.apache.wiki.auth.user.XMLUserDatabaseTest
Running org.apache.wiki.auth.GroupManagerTest
Tests run: 4, Failures: 0, Errors: 0, Skipped: 0, Time elapsed: 0.079 sec - in org.apache.wiki.auth.GroupManagerTest
Running org.apache.wiki.auth.login.AnonymousLoginModuleTest
Tests run: 2, Failures: 0, Errors: 0, Skipped: 0, Time elapsed: 0.031 sec - in org.apache.wiki.auth.login.AnonymousLoginModuleTest
Running org.apache.wiki.auth.login.UserDatabaseLoginModuleTest
Tests run: 2, Failures: 0, Errors: 0, Skipped: 0, Time elapsed: 0.035 sec - in org.apache.wiki.auth.login.UserDatabaseLoginModuleTest
Running org.apache.wiki.auth.login.WebContainerLoginModuleTest
Tests run: 2, Failures: 0, Errors: 0, Skipped: 0, Time elapsed: 0.034 sec - in org.apache.wiki.auth.login.WebContainerLoginModuleTest
Running org.apache.wiki.auth.login.CookieAssertionLoginModuleTest
Tests run: 2, Failures: 0, Errors: 0, Skipped: 0, Time elapsed: 0.033 sec - in org.apache.wiki.auth.login.CookieAssertionLoginModuleTest
Running org.apache.wiki.auth.AuthenticationManagerTest
Tests run: 6, Failures: 0, Errors: 0, Skipped: 0, Time elapsed: 0.187 sec - in org.apache.wiki.auth.AuthenticationManagerTest
Running org.apache.wiki.auth.permissions.GroupPermissionTest
Tests run: 10, Failures: 0, Errors: 0, Skipped: 0, Time elapsed: 0.007 sec - in org.apache.wiki.auth.permissions.GroupPermissionTest
Running org.apache.wiki.auth.permissions.PagePermissionTest
Tests run: 10, Failures: 0, Errors: 0, Skipped: 0, Time elapsed: 0.005 sec - in org.apache.wiki.auth.permissions.PagePermissionTest
Running org.apache.wiki.auth.permissions.AllPermissionCollectionTest
Tests run: 8, Failures: 0, Errors: 0, Skipped: 0, Time elapsed: 0.005 sec - in org.apache.wiki.auth.permissions.AllPermissionCollectionTest
Running org.apache.wiki.auth.permissions.AllPermissionTest
Tests run: 5, Failures: 0, Errors: 0, Skipped: 0, Time elapsed: 0.002 sec - in org.apache.wiki.auth.permissions.AllPermissionTest
Running org.apache.wiki.auth.permissions.WikiPermissionTest
Tests run: 10, Failures: 0, Errors: 0, Skipped: 0, Time elapsed: 0.004 sec - in org.apache.wiki.auth.permissions.WikiPermissionTest
Running org.apache.wiki.auth.acl.AclImplTest
Tests run: 6, Failures: 0, Errors: 0, Skipped: 0, Time elapsed: 0.106 sec - in org.apache.wiki.auth.acl.AclImplTest
Running org.apache.wiki.auth.acl.AclEntryImplTest
Tests run: 7, Failures: 0, Errors: 0, Skipped: 0, Time elapsed: 0.002 sec - in org.apache.wiki.auth.acl.AclEntryImplTest
Running org.apache.wiki.auth.acl.DefaultAclManagerTest
[{ALLOW view Alice}]
[{   ALLOW   view   Alice  }]
[{   ALLOW   view  Alice  ,  Bob  }]
[{   ALLOW   view  Alice  ,  Bob  }]
Tests run: 3, Failures: 0, Errors: 0, Skipped: 0, Time elapsed: 0.06 sec - in org.apache.wiki.auth.acl.DefaultAclManagerTest
Running org.apache.wiki.search.SearchManagerTest
SearchManagerTest.waitForIndex for testTitleSearch2 sleeping 0 (out of 20)
SearchManagerTest.waitForIndex for testSimpleSearch sleeping 0 (out of 20)
SearchManagerTest.waitForIndex for testSimpleSearch sleeping 1 (out of 20)
SearchManagerTest.waitForIndex for testSimpleSearch sleeping 2 (out of 20)
SearchManagerTest.waitForIndex for testSimpleSearch sleeping 3 (out of 20)
SearchManagerTest.waitForIndex for testSimpleSearch sleeping 4 (out of 20)
SearchManagerTest.waitForIndex for testTitleSearch sleeping 0 (out of 20)
SearchManagerTest.waitForIndex for testTitleSearch sleeping 1 (out of 20)
SearchManagerTest.waitForIndex for testTitleSearch sleeping 2 (out of 20)
SearchManagerTest.waitForIndex for testTitleSearch sleeping 3 (out of 20)
SearchManagerTest.waitForIndex for testTitleSearch sleeping 4 (out of 20)
SearchManagerTest.waitForIndex for testSimpleSearch2 sleeping 0 (out of 20)
SearchManagerTest.waitForIndex for testSimpleSearch2 sleeping 1 (out of 20)
SearchManagerTest.waitForIndex for testSimpleSearch2 sleeping 2 (out of 20)
SearchManagerTest.waitForIndex for testSimpleSearch2 sleeping 3 (out of 20)
SearchManagerTest.waitForIndex for testSimpleSearch2 sleeping 4 (out of 20)
SearchManagerTest.waitForIndex for testSimpleSearch2 sleeping 5 (out of 20)
SearchManagerTest.waitForIndex for testSimpleSearch3 sleeping 0 (out of 20)
SearchManagerTest.waitForIndex for testSimpleSearch3 sleeping 1 (out of 20)
SearchManagerTest.waitForIndex for testSimpleSearch3 sleeping 2 (out of 20)
SearchManagerTest.waitForIndex for testSimpleSearch3 sleeping 3 (out of 20)
SearchManagerTest.waitForIndex for testSimpleSearch3 sleeping 4 (out of 20)
SearchManagerTest.waitForIndex for testSimpleSearch3 sleeping 5 (out of 20)
Tests run: 6, Failures: 0, Errors: 0, Skipped: 0, Time elapsed: 23.475 sec - in org.apache.wiki.search.SearchManagerTest
Running org.apache.wiki.render.WysiwygEditingRendererTest
Tests run: 2, Failures: 0, Errors: 0, Skipped: 0, Time elapsed: 0.047 sec - in org.apache.wiki.render.WysiwygEditingRendererTest
Running org.apache.wiki.render.CreoleRendererTest
Tests run: 14, Failures: 0, Errors: 0, Skipped: 0, Time elapsed: 0.196 sec - in org.apache.wiki.render.CreoleRendererTest
Running org.apache.wiki.render.RenderingManagerTest
DOM cache speed test:
  Nocache took 0:00:00.228
  Cache took 0:00:00.030
  Approx speedup: 7x
Tests run: 1, Failures: 0, Errors: 0, Skipped: 0, Time elapsed: 0.284 sec - in org.apache.wiki.render.RenderingManagerTest
Running org.apache.wiki.ui.PageCommandTest
Tests run: 2, Failures: 0, Errors: 0, Skipped: 0, Time elapsed: 0.033 sec - in org.apache.wiki.ui.PageCommandTest
Running org.apache.wiki.ui.CommandResolverTest
Tests run: 6, Failures: 0, Errors: 0, Skipped: 0, Time elapsed: 0.11 sec - in org.apache.wiki.ui.CommandResolverTest
Running org.apache.wiki.ui.WikiCommandTest
Tests run: 2, Failures: 0, Errors: 0, Skipped: 0, Time elapsed: 0.028 sec - in org.apache.wiki.ui.WikiCommandTest
Running org.apache.wiki.ui.GroupCommandTest
Tests run: 2, Failures: 0, Errors: 0, Skipped: 0, Time elapsed: 0.026 sec - in org.apache.wiki.ui.GroupCommandTest
Running org.apache.wiki.ui.InputValidatorTest
Tests run: 4, Failures: 0, Errors: 0, Skipped: 0, Time elapsed: 0.047 sec - in org.apache.wiki.ui.InputValidatorTest
Running org.apache.wiki.ui.RedirectCommandTest
Tests run: 2, Failures: 0, Errors: 0, Skipped: 0, Time elapsed: 0 sec - in org.apache.wiki.ui.RedirectCommandTest
Running org.apache.wiki.filters.DefaultFilterManagerTest
Tests run: 2, Failures: 0, Errors: 0, Skipped: 0, Time elapsed: 0.031 sec - in org.apache.wiki.filters.DefaultFilterManagerTest
Running org.apache.wiki.diff.ContextualDiffProviderTest
Tests run: 6, Failures: 0, Errors: 0, Skipped: 0, Time elapsed: 0.449 sec - in org.apache.wiki.diff.ContextualDiffProviderTest
Running org.apache.wiki.PropertyReaderTest
/p/mywiki/wrk/
Tests run: 3, Failures: 0, Errors: 0, Skipped: 0, Time elapsed: 0.001 sec - in org.apache.wiki.PropertyReaderTest
Running org.apache.wiki.providers.VersioningFileProviderTest
Tests run: 15, Failures: 0, Errors: 0, Skipped: 0, Time elapsed: 0.433 sec - in org.apache.wiki.providers.VersioningFileProviderTest
Running org.apache.wiki.providers.FileSystemProviderTest
Tests run: 9, Failures: 0, Errors: 0, Skipped: 0, Time elapsed: 0.121 sec - in org.apache.wiki.providers.FileSystemProviderTest
Running org.apache.wiki.providers.BasicAttachmentProviderTest
Tests run: 12, Failures: 0, Errors: 0, Skipped: 0, Time elapsed: 10.215 sec - in org.apache.wiki.providers.BasicAttachmentProviderTest
Running org.apache.wiki.providers.CachingProviderTest
Tests run: 2, Failures: 0, Errors: 0, Skipped: 0, Time elapsed: 4.052 sec - in org.apache.wiki.providers.CachingProviderTest
Running org.apache.wiki.providers.RCSFileProviderTest
Tests run: 8, Failures: 0, Errors: 0, Skipped: 0, Time elapsed: 0.127 sec - in org.apache.wiki.providers.RCSFileProviderTest
Running org.apache.wiki.workflow.OutcomeTest
Tests run: 6, Failures: 0, Errors: 0, Skipped: 0, Time elapsed: 0.011 sec - in org.apache.wiki.workflow.OutcomeTest
Running org.apache.wiki.workflow.DecisionQueueTest
Tests run: 7, Failures: 0, Errors: 0, Skipped: 0, Time elapsed: 0.092 sec - in org.apache.wiki.workflow.DecisionQueueTest
Running org.apache.wiki.workflow.SimpleDecisionTest
Tests run: 16, Failures: 0, Errors: 0, Skipped: 0, Time elapsed: 0.002 sec - in org.apache.wiki.workflow.SimpleDecisionTest
Running org.apache.wiki.workflow.FactTest
Tests run: 1, Failures: 0, Errors: 0, Skipped: 0, Time elapsed: 0 sec - in org.apache.wiki.workflow.FactTest
Running org.apache.wiki.workflow.WorkflowManagerTest
Tests run: 4, Failures: 0, Errors: 0, Skipped: 0, Time elapsed: 0.038 sec - in org.apache.wiki.workflow.WorkflowManagerTest
Running org.apache.wiki.workflow.TaskTest
Tests run: 12, Failures: 0, Errors: 0, Skipped: 0, Time elapsed: 0.003 sec - in org.apache.wiki.workflow.TaskTest
Running org.apache.wiki.workflow.ApprovalWorkflowTest
Tests run: 5, Failures: 0, Errors: 0, Skipped: 0, Time elapsed: 0.067 sec - in org.apache.wiki.workflow.ApprovalWorkflowTest
Running org.apache.wiki.workflow.WorkflowTest
Tests run: 24, Failures: 0, Errors: 0, Skipped: 0, Time elapsed: 0.002 sec - in org.apache.wiki.workflow.WorkflowTest
Running org.apache.wiki.ReferenceManagerTest
Tests run: 18, Failures: 0, Errors: 0, Skipped: 0, Time elapsed: 0.407 sec - in org.apache.wiki.ReferenceManagerTest
Running org.apache.wiki.attachment.AttachmentManagerTest
Tests run: 14, Failures: 0, Errors: 0, Skipped: 0, Time elapsed: 0.537 sec - in org.apache.wiki.attachment.AttachmentManagerTest
Running org.apache.wiki.WikiEngineTest
Tests run: 43, Failures: 0, Errors: 0, Skipped: 0, Time elapsed: 18.634 sec - in org.apache.wiki.WikiEngineTest
Running org.apache.wiki.i18n.InternationalizationManagerTest
Tests run: 2, Failures: 0, Errors: 0, Skipped: 0, Time elapsed: 0 sec - in org.apache.wiki.i18n.InternationalizationManagerTest
Running org.apache.wiki.parser.JSPWikiMarkupParserTest
Trying to crash parser with a line which is 198002 chars in size
100 page renderings: 0:00:00.133 (751.8796992481202 renderings/second)
Tests run: 205, Failures: 0, Errors: 0, Skipped: 0, Time elapsed: 3.393 sec - in org.apache.wiki.parser.JSPWikiMarkupParserTest
Running org.apache.wiki.parser.CreoleToJSPWikiTranslatorTest
Tests run: 84, Failures: 0, Errors: 0, Skipped: 0, Time elapsed: 0.115 sec - in org.apache.wiki.parser.CreoleToJSPWikiTranslatorTest
Running org.apache.wiki.parser.MarkupParserTest
Tests run: 3, Failures: 0, Errors: 0, Skipped: 0, Time elapsed: 0 sec - in org.apache.wiki.parser.MarkupParserTest
Running org.apache.wiki.stress.MassiveRepositoryTest
Creating 1000 pages
....................................................................................................
Took 0:00:08.622, which is 115.9823706796567 adds/second
Checking in 1000 revisions
....................................................................................................
Took 0:00:11.440, which is 87.41258741258741 adds/second
Rendering 10000 pages
....................................................................................................
Took 0:00:02.519, which is 3969.8292973402145 renders/second
Tests run: 1, Failures: 0, Errors: 0, Skipped: 0, Time elapsed: 22.881 sec - in org.apache.wiki.stress.MassiveRepositoryTest

Results :

Tests in error: 
  JDBCGroupDatabaseTest.setUp:91 SQL java.lang.NullPointerException java.lang.Nu...
  JDBCUserDatabaseTest.setUp:131 SQL java.lang.NullPointerException java.lang.Nu...
  JDBCUserDatabaseTest.setUp:131 SQL java.lang.NullPointerException java.lang.Nu...
  JDBCUserDatabaseTest.setUp:131 SQL java.lang.NullPointerException java.lang.Nu...
  JDBCUserDatabaseTest.setUp:131 SQL java.lang.NullPointerException java.lang.Nu...
  JDBCUserDatabaseTest.setUp:131 SQL java.lang.NullPointerException java.lang.Nu...
  JDBCUserDatabaseTest.setUp:131 SQL java.lang.NullPointerException java.lang.Nu...
  JDBCUserDatabaseTest.setUp:131 SQL java.lang.NullPointerException java.lang.Nu...
  JDBCUserDatabaseTest.setUp:131 SQL java.lang.NullPointerException java.lang.Nu...
  JDBCUserDatabaseTest.setUp:131 SQL java.lang.NullPointerException java.lang.Nu...
  JDBCUserDatabaseTest.setUp:131 SQL java.lang.NullPointerException java.lang.Nu...
  JDBCUserDatabaseTest.setUp:131 SQL java.lang.NullPointerException java.lang.Nu...

Tests run: 945, Failures: 0, Errors: 12, Skipped: 0

[INFO] ------------------------------------------------------------------------
[INFO] Reactor Summary:
[INFO] 
[INFO] Apache JSPWiki .................................... SUCCESS [4.150s]
[INFO] Apache JSPWiki Main War ........................... FAILURE [2:34.601s]
[INFO] Apache JSPWiki's website .......................... SKIPPED
[INFO] jspwiki-selenium-tests ............................ SKIPPED
[INFO] jspwiki-it-builder ................................ SKIPPED
[INFO] jspwiki-it-test-custom ............................ SKIPPED
[INFO] jspwiki-it-test-custom-absolute-urls .............. SKIPPED
[INFO] jspwiki-it-test-custom-jdbc ....................... SKIPPED
[INFO] jspwiki-it-test-container ......................... SKIPPED
[INFO] jspwiki-it-test-container-jdbc .................... SKIPPED
[INFO] ------------------------------------------------------------------------
[INFO] BUILD FAILURE
[INFO] ------------------------------------------------------------------------
[INFO] Total time: 2:39.494s
[INFO] Finished at: Sun Aug 04 16:09:29 UTC 2013
[INFO] Final Memory: 31M/391M
[INFO] ------------------------------------------------------------------------
[ERROR] Failed to execute goal org.apache.maven.plugins:maven-surefire-plugin:2.15:test (default-test)
on project jspwiki-war: There are test failures.
[ERROR] 
[ERROR] Please refer to <https://builds.apache.org/job/JSPWiki/ws/jspwiki-war/target/surefire-reports>
for the individual test results.
[ERROR] -> [Help 1]
[ERROR] 
[ERROR] To see the full stack trace of the errors, re-run Maven with the -e switch.
[ERROR] Re-run Maven using the -X switch to enable full debug logging.
[ERROR] 
[ERROR] For more information about the errors and possible solutions, please read the following
articles:
[ERROR] [Help 1] http://cwiki.apache.org/confluence/display/MAVEN/MojoFailureException
[ERROR] 
[ERROR] After correcting the problems, you can resume the build with the command
[ERROR]   mvn <goals> -rf :jspwiki-war
Build step 'Invoke top-level Maven targets' marked build as failure

Mime
View raw message