jspwiki-commits mailing list archives

Site index · List index
Message view « Date » · « Thread »
Top « Date » · « Thread »
From Apache Jenkins Server <jenk...@builds.apache.org>
Subject Build failed in Jenkins: JSPWiki #175
Date Sun, 04 Aug 2013 14:19:16 GMT
See <https://builds.apache.org/job/JSPWiki/175/changes>

Changes:

[metskem] trying out more wait time for JSPWIKI-799...

------------------------------------------
[...truncated 232 lines...]
Running org.apache.wiki.parser.JSPWikiMarkupParserTest
Trying to crash parser with a line which is 198002 chars in size
100 page renderings: 0:00:00.157 (636.9426751592356 renderings/second)
Tests run: 205, Failures: 0, Errors: 0, Skipped: 0, Time elapsed: 3.997 sec - in org.apache.wiki.parser.JSPWikiMarkupParserTest
Running org.apache.wiki.parser.CreoleToJSPWikiTranslatorTest
Tests run: 84, Failures: 0, Errors: 0, Skipped: 0, Time elapsed: 0.176 sec - in org.apache.wiki.parser.CreoleToJSPWikiTranslatorTest
Running org.apache.wiki.parser.MarkupParserTest
Tests run: 3, Failures: 0, Errors: 0, Skipped: 0, Time elapsed: 0 sec - in org.apache.wiki.parser.MarkupParserTest
Running org.apache.wiki.ui.WikiCommandTest
Tests run: 2, Failures: 0, Errors: 0, Skipped: 0, Time elapsed: 0.02 sec - in org.apache.wiki.ui.WikiCommandTest
Running org.apache.wiki.ui.CommandResolverTest
Tests run: 6, Failures: 0, Errors: 0, Skipped: 0, Time elapsed: 0.077 sec - in org.apache.wiki.ui.CommandResolverTest
Running org.apache.wiki.ui.InputValidatorTest
Tests run: 4, Failures: 0, Errors: 0, Skipped: 0, Time elapsed: 0.046 sec - in org.apache.wiki.ui.InputValidatorTest
Running org.apache.wiki.ui.PageCommandTest
Tests run: 2, Failures: 0, Errors: 0, Skipped: 0, Time elapsed: 0.03 sec - in org.apache.wiki.ui.PageCommandTest
Running org.apache.wiki.ui.GroupCommandTest
Tests run: 2, Failures: 0, Errors: 0, Skipped: 0, Time elapsed: 0.022 sec - in org.apache.wiki.ui.GroupCommandTest
Running org.apache.wiki.ui.RedirectCommandTest
Tests run: 2, Failures: 0, Errors: 0, Skipped: 0, Time elapsed: 0 sec - in org.apache.wiki.ui.RedirectCommandTest
Running org.apache.wiki.WikiSessionTest
Tests run: 7, Failures: 0, Errors: 0, Skipped: 0, Time elapsed: 0.11 sec - in org.apache.wiki.WikiSessionTest
Running org.apache.wiki.PropertyReaderTest
/p/mywiki/wrk/
Tests run: 3, Failures: 0, Errors: 0, Skipped: 0, Time elapsed: 0.001 sec - in org.apache.wiki.PropertyReaderTest
Running org.apache.wiki.auth.acl.AclEntryImplTest
Tests run: 7, Failures: 0, Errors: 0, Skipped: 0, Time elapsed: 0.002 sec - in org.apache.wiki.auth.acl.AclEntryImplTest
Running org.apache.wiki.auth.acl.DefaultAclManagerTest
[{ALLOW view Alice}]
[{   ALLOW   view   Alice  }]
[{   ALLOW   view  Alice  ,  Bob  }]
[{   ALLOW   view  Alice  ,  Bob  }]
Tests run: 3, Failures: 0, Errors: 0, Skipped: 0, Time elapsed: 0.061 sec - in org.apache.wiki.auth.acl.DefaultAclManagerTest
Running org.apache.wiki.auth.acl.AclImplTest
Tests run: 6, Failures: 0, Errors: 0, Skipped: 0, Time elapsed: 0.087 sec - in org.apache.wiki.auth.acl.AclImplTest
Running org.apache.wiki.auth.login.WebContainerLoginModuleTest
Tests run: 2, Failures: 0, Errors: 0, Skipped: 0, Time elapsed: 0.026 sec - in org.apache.wiki.auth.login.WebContainerLoginModuleTest
Running org.apache.wiki.auth.login.AnonymousLoginModuleTest
Tests run: 2, Failures: 0, Errors: 0, Skipped: 0, Time elapsed: 0.026 sec - in org.apache.wiki.auth.login.AnonymousLoginModuleTest
Running org.apache.wiki.auth.login.UserDatabaseLoginModuleTest
Tests run: 2, Failures: 0, Errors: 0, Skipped: 0, Time elapsed: 0.026 sec - in org.apache.wiki.auth.login.UserDatabaseLoginModuleTest
Running org.apache.wiki.auth.login.CookieAssertionLoginModuleTest
Tests run: 2, Failures: 0, Errors: 0, Skipped: 0, Time elapsed: 0.025 sec - in org.apache.wiki.auth.login.CookieAssertionLoginModuleTest
Running org.apache.wiki.auth.permissions.PagePermissionTest
Tests run: 10, Failures: 0, Errors: 0, Skipped: 0, Time elapsed: 0.002 sec - in org.apache.wiki.auth.permissions.PagePermissionTest
Running org.apache.wiki.auth.permissions.WikiPermissionTest
Tests run: 10, Failures: 0, Errors: 0, Skipped: 0, Time elapsed: 0.002 sec - in org.apache.wiki.auth.permissions.WikiPermissionTest
Running org.apache.wiki.auth.permissions.AllPermissionTest
Tests run: 5, Failures: 0, Errors: 0, Skipped: 0, Time elapsed: 0.001 sec - in org.apache.wiki.auth.permissions.AllPermissionTest
Running org.apache.wiki.auth.permissions.AllPermissionCollectionTest
Tests run: 8, Failures: 0, Errors: 0, Skipped: 0, Time elapsed: 0.002 sec - in org.apache.wiki.auth.permissions.AllPermissionCollectionTest
Running org.apache.wiki.auth.permissions.GroupPermissionTest
Tests run: 10, Failures: 0, Errors: 0, Skipped: 0, Time elapsed: 0.005 sec - in org.apache.wiki.auth.permissions.GroupPermissionTest
Running org.apache.wiki.auth.GroupManagerTest
Tests run: 4, Failures: 0, Errors: 0, Skipped: 0, Time elapsed: 0.063 sec - in org.apache.wiki.auth.GroupManagerTest
Running org.apache.wiki.auth.AuthorizationManagerTest
Tests run: 17, Failures: 0, Errors: 0, Skipped: 0, Time elapsed: 0.304 sec - in org.apache.wiki.auth.AuthorizationManagerTest
Running org.apache.wiki.auth.AuthenticationManagerTest
Tests run: 6, Failures: 0, Errors: 0, Skipped: 0, Time elapsed: 0.112 sec - in org.apache.wiki.auth.AuthenticationManagerTest
Running org.apache.wiki.auth.UserManagerTest
Tests run: 5, Failures: 0, Errors: 0, Skipped: 0, Time elapsed: 1.066 sec - in org.apache.wiki.auth.UserManagerTest
Running org.apache.wiki.auth.authorize.WebContainerAuthorizerTest
Tests run: 4, Failures: 0, Errors: 0, Skipped: 0, Time elapsed: 0.071 sec - in org.apache.wiki.auth.authorize.WebContainerAuthorizerTest
Running org.apache.wiki.auth.authorize.JDBCGroupDatabaseTest
[Server@b6e46]: [Thread[main,5,main]]: setSilent(true)
[Server@7439fe]: [Thread[main,5,main]]: setSilent(true)
[Server@1cc2368]: [Thread[main,5,main]]: setSilent(true)
[Server@1320ebf]: [Thread[main,5,main]]: setSilent(true)
Tests run: 4, Failures: 0, Errors: 0, Skipped: 0, Time elapsed: 21.946 sec - in org.apache.wiki.auth.authorize.JDBCGroupDatabaseTest
Running org.apache.wiki.auth.authorize.GroupTest
Tests run: 8, Failures: 0, Errors: 0, Skipped: 0, Time elapsed: 0.094 sec - in org.apache.wiki.auth.authorize.GroupTest
Running org.apache.wiki.auth.authorize.XMLGroupDatabaseTest
Tests run: 4, Failures: 0, Errors: 0, Skipped: 0, Time elapsed: 0.066 sec - in org.apache.wiki.auth.authorize.XMLGroupDatabaseTest
Running org.apache.wiki.auth.user.JDBCUserDatabaseTest
[Server@1cc5d5a]: [Thread[main,5,main]]: setSilent(true)
[Server@1ad5432]: [Thread[main,5,main]]: setSilent(true)
[Server@18377d6]: [Thread[main,5,main]]: setSilent(true)
[Server@1360860]: [Thread[main,5,main]]: setSilent(true)
[Server@1943319]: [Thread[main,5,main]]: setSilent(true)
[Server@137146d]: [Thread[main,5,main]]: setSilent(true)
[Server@562dcf]: [Thread[main,5,main]]: setSilent(true)
[Server@c30f48]: [Thread[main,5,main]]: setSilent(true)
[Server@1d0e2d2]: [Thread[main,5,main]]: setSilent(true)
[Server@32e0ec]: [Thread[main,5,main]]: setSilent(true)
[Server@1b12262]: [Thread[main,5,main]]: setSilent(true)
Tests run: 11, Failures: 0, Errors: 0, Skipped: 0, Time elapsed: 31.08 sec - in org.apache.wiki.auth.user.JDBCUserDatabaseTest
Running org.apache.wiki.auth.user.XMLUserDatabaseTest
Tests run: 11, Failures: 0, Errors: 0, Skipped: 0, Time elapsed: 0.149 sec - in org.apache.wiki.auth.user.XMLUserDatabaseTest
Running org.apache.wiki.auth.user.UserProfileTest
Tests run: 5, Failures: 0, Errors: 0, Skipped: 0, Time elapsed: 0.062 sec - in org.apache.wiki.auth.user.UserProfileTest
Running org.apache.wiki.render.RenderingManagerTest
DOM cache speed test:
  Nocache took 0:00:00.138
  Cache took 0:00:00.010
  Approx speedup: 13x
Tests run: 1, Failures: 0, Errors: 0, Skipped: 0, Time elapsed: 0.17 sec - in org.apache.wiki.render.RenderingManagerTest
Running org.apache.wiki.render.CreoleRendererTest
Tests run: 14, Failures: 0, Errors: 0, Skipped: 0, Time elapsed: 0.167 sec - in org.apache.wiki.render.CreoleRendererTest
Running org.apache.wiki.render.WysiwygEditingRendererTest
Tests run: 2, Failures: 0, Errors: 0, Skipped: 0, Time elapsed: 0.048 sec - in org.apache.wiki.render.WysiwygEditingRendererTest
Running org.apache.wiki.content.PageRenamerTest
Tests run: 21, Failures: 0, Errors: 0, Skipped: 0, Time elapsed: 0.585 sec - in org.apache.wiki.content.PageRenamerTest
Running org.apache.wiki.xmlrpc.RPCHandlerTest
Real: Sun Aug 04 14:17:51 UTC 2013
RPC:  Sun Aug 04 14:17:51 UTC 2013
RPC2: Sun Aug 04 14:17:51 UTC 2013
Tests run: 6, Failures: 0, Errors: 0, Skipped: 0, Time elapsed: 0.104 sec - in org.apache.wiki.xmlrpc.RPCHandlerTest
Running org.apache.wiki.WikiEngineTest
Tests run: 43, Failures: 0, Errors: 0, Skipped: 0, Time elapsed: 19.357 sec - in org.apache.wiki.WikiEngineTest
Running org.apache.wiki.filters.DefaultFilterManagerTest
Tests run: 2, Failures: 0, Errors: 0, Skipped: 0, Time elapsed: 0.02 sec - in org.apache.wiki.filters.DefaultFilterManagerTest
Running org.apache.wiki.ReferenceManagerTest
Tests run: 18, Failures: 0, Errors: 0, Skipped: 0, Time elapsed: 0.36 sec - in org.apache.wiki.ReferenceManagerTest
Running org.apache.wiki.util.ClassUtilTest
Tests run: 3, Failures: 0, Errors: 0, Skipped: 0, Time elapsed: 0.055 sec - in org.apache.wiki.util.ClassUtilTest
Running org.apache.wiki.util.PageSorterTest
Tests run: 5, Failures: 0, Errors: 0, Skipped: 0, Time elapsed: 0.003 sec - in org.apache.wiki.util.PageSorterTest
Running org.apache.wiki.util.TextUtilTest
Tests run: 40, Failures: 0, Errors: 0, Skipped: 0, Time elapsed: 0.045 sec - in org.apache.wiki.util.TextUtilTest
Running org.apache.wiki.util.FileUtilTest
Tests run: 5, Failures: 0, Errors: 0, Skipped: 0, Time elapsed: 0.022 sec - in org.apache.wiki.util.FileUtilTest
Running org.apache.wiki.util.CryptoUtilTest
Tests run: 8, Failures: 0, Errors: 0, Skipped: 0, Time elapsed: 0.004 sec - in org.apache.wiki.util.CryptoUtilTest
Running org.apache.wiki.util.MailUtilTest
Tests run: 2, Failures: 0, Errors: 0, Skipped: 0, Time elapsed: 0.121 sec - in org.apache.wiki.util.MailUtilTest
Running org.apache.wiki.util.SerializerTest
Tests run: 1, Failures: 0, Errors: 0, Skipped: 0, Time elapsed: 0 sec - in org.apache.wiki.util.SerializerTest
Running org.apache.wiki.util.PriorityListTest
Tests run: 4, Failures: 0, Errors: 0, Skipped: 0, Time elapsed: 0 sec - in org.apache.wiki.util.PriorityListTest
Running org.apache.wiki.util.CommentedPropertiesTest
Tests run: 4, Failures: 0, Errors: 0, Skipped: 0, Time elapsed: 0.002 sec - in org.apache.wiki.util.CommentedPropertiesTest
Running org.apache.wiki.util.comparators.HumanComparatorTest
Tests run: 2, Failures: 0, Errors: 0, Skipped: 0, Time elapsed: 0 sec - in org.apache.wiki.util.comparators.HumanComparatorTest
Running org.apache.wiki.util.UtilJ2eeCompatTest
Tests run: 3, Failures: 0, Errors: 0, Skipped: 0, Time elapsed: 0.001 sec - in org.apache.wiki.util.UtilJ2eeCompatTest
Running org.apache.wiki.util.TimedCounterListTest
Tests run: 2, Failures: 0, Errors: 0, Skipped: 0, Time elapsed: 0.111 sec - in org.apache.wiki.util.TimedCounterListTest
Running org.apache.wiki.htmltowiki.HtmlStringToWikiTranslatorTest
Tests run: 17, Failures: 0, Errors: 0, Skipped: 0, Time elapsed: 0.08 sec - in org.apache.wiki.htmltowiki.HtmlStringToWikiTranslatorTest
Running org.apache.wiki.plugin.GroupsTest
Tests run: 1, Failures: 0, Errors: 0, Skipped: 0, Time elapsed: 0.016 sec - in org.apache.wiki.plugin.GroupsTest
Running org.apache.wiki.plugin.IfPluginTest
Tests run: 4, Failures: 0, Errors: 0, Skipped: 0, Time elapsed: 0.059 sec - in org.apache.wiki.plugin.IfPluginTest
Running org.apache.wiki.plugin.CounterPluginTest
Tests run: 6, Failures: 0, Errors: 0, Skipped: 0, Time elapsed: 0.068 sec - in org.apache.wiki.plugin.CounterPluginTest
Running org.apache.wiki.plugin.DefaultPluginManagerTest
Tests run: 15, Failures: 0, Errors: 0, Skipped: 0, Time elapsed: 0.161 sec - in org.apache.wiki.plugin.DefaultPluginManagerTest
Running org.apache.wiki.plugin.RecentChangesPluginTest
Tests run: 3, Failures: 0, Errors: 0, Skipped: 0, Time elapsed: 0.076 sec - in org.apache.wiki.plugin.RecentChangesPluginTest
Running org.apache.wiki.plugin.ReferringPagesPluginTest
Tests run: 8, Failures: 0, Errors: 0, Skipped: 0, Time elapsed: 0.319 sec - in org.apache.wiki.plugin.ReferringPagesPluginTest
Running org.apache.wiki.plugin.PageViewPluginTest
Tests run: 4, Failures: 0, Errors: 0, Skipped: 0, Time elapsed: 0.132 sec - in org.apache.wiki.plugin.PageViewPluginTest
Running org.apache.wiki.plugin.TableOfContentsTest
Tests run: 8, Failures: 0, Errors: 0, Skipped: 0, Time elapsed: 0.143 sec - in org.apache.wiki.plugin.TableOfContentsTest
Running org.apache.wiki.plugin.UndefinedPagesPluginTest
Tests run: 2, Failures: 0, Errors: 0, Skipped: 0, Time elapsed: 0.035 sec - in org.apache.wiki.plugin.UndefinedPagesPluginTest
Running org.apache.wiki.plugin.InsertPageTest
Tests run: 6, Failures: 0, Errors: 0, Skipped: 0, Time elapsed: 0.107 sec - in org.apache.wiki.plugin.InsertPageTest
Running org.apache.wiki.i18n.InternationalizationManagerTest
Tests run: 2, Failures: 0, Errors: 0, Skipped: 0, Time elapsed: 0 sec - in org.apache.wiki.i18n.InternationalizationManagerTest
Running org.apache.wiki.stress.MassiveRepositoryTest
Creating 1000 pages
....................................................................................................
Took 0:00:08.802, which is 113.61054305839582 adds/second
Checking in 1000 revisions
....................................................................................................
Took 0:00:15.888, which is 62.94058408862034 adds/second
Rendering 10000 pages
....................................................................................................
Took 0:00:02.431, which is 4113.533525298231 renders/second
Tests run: 1, Failures: 0, Errors: 0, Skipped: 0, Time elapsed: 57.272 sec - in org.apache.wiki.stress.MassiveRepositoryTest
Running org.apache.wiki.search.SearchManagerTest
Tests run: 6, Failures: 0, Errors: 5, Skipped: 0, Time elapsed: 5.185 sec <<< FAILURE!
- in org.apache.wiki.search.SearchManagerTest
testTitleSearch2(org.apache.wiki.search.SearchManagerTest)  Time elapsed: 1.038 sec  <<<
ERROR!
java.lang.NullPointerException: null
	at org.apache.wiki.search.SearchManagerTest.waitForIndex(SearchManagerTest.java:80)
	at org.apache.wiki.search.SearchManagerTest.testTitleSearch2(SearchManagerTest.java:182)

testSimpleSearch(org.apache.wiki.search.SearchManagerTest)  Time elapsed: 1.092 sec  <<<
ERROR!
java.lang.NullPointerException: null
	at org.apache.wiki.search.SearchManagerTest.waitForIndex(SearchManagerTest.java:80)
	at org.apache.wiki.search.SearchManagerTest.testSimpleSearch(SearchManagerTest.java:99)

testTitleSearch(org.apache.wiki.search.SearchManagerTest)  Time elapsed: 1.015 sec  <<<
ERROR!
java.lang.NullPointerException: null
	at org.apache.wiki.search.SearchManagerTest.waitForIndex(SearchManagerTest.java:80)
	at org.apache.wiki.search.SearchManagerTest.testTitleSearch(SearchManagerTest.java:165)

testSimpleSearch2(org.apache.wiki.search.SearchManagerTest)  Time elapsed: 1.014 sec  <<<
ERROR!
java.lang.NullPointerException: null
	at org.apache.wiki.search.SearchManagerTest.waitForIndex(SearchManagerTest.java:80)
	at org.apache.wiki.search.SearchManagerTest.testSimpleSearch2(SearchManagerTest.java:118)

testSimpleSearch3(org.apache.wiki.search.SearchManagerTest)  Time elapsed: 1.014 sec  <<<
ERROR!
java.lang.NullPointerException: null
	at org.apache.wiki.search.SearchManagerTest.waitForIndex(SearchManagerTest.java:80)
	at org.apache.wiki.search.SearchManagerTest.testSimpleSearch3(SearchManagerTest.java:142)

Running org.apache.wiki.PageManagerTest
Tests run: 2, Failures: 0, Errors: 0, Skipped: 0, Time elapsed: 0.037 sec - in org.apache.wiki.PageManagerTest
Running org.apache.wiki.rss.RSSGeneratorTest
Tests run: 2, Failures: 0, Errors: 0, Skipped: 0, Time elapsed: 0.112 sec - in org.apache.wiki.rss.RSSGeneratorTest

Results :

Tests in error: 
  SearchManagerTest.testTitleSearch2:182->waitForIndex:80 NullPointer
  SearchManagerTest.testSimpleSearch:99->waitForIndex:80 NullPointer
  SearchManagerTest.testTitleSearch:165->waitForIndex:80 NullPointer
  SearchManagerTest.testSimpleSearch2:118->waitForIndex:80 NullPointer
  SearchManagerTest.testSimpleSearch3:142->waitForIndex:80 NullPointer

Tests run: 945, Failures: 0, Errors: 5, Skipped: 0

[INFO] ------------------------------------------------------------------------
[INFO] Reactor Summary:
[INFO] 
[INFO] Apache JSPWiki .................................... SUCCESS [1.555s]
[INFO] Apache JSPWiki Main War ........................... FAILURE [3:29.330s]
[INFO] Apache JSPWiki's website .......................... SKIPPED
[INFO] jspwiki-selenium-tests ............................ SKIPPED
[INFO] jspwiki-it-builder ................................ SKIPPED
[INFO] jspwiki-it-test-custom ............................ SKIPPED
[INFO] jspwiki-it-test-custom-absolute-urls .............. SKIPPED
[INFO] jspwiki-it-test-custom-jdbc ....................... SKIPPED
[INFO] jspwiki-it-test-container ......................... SKIPPED
[INFO] jspwiki-it-test-container-jdbc .................... SKIPPED
[INFO] ------------------------------------------------------------------------
[INFO] BUILD FAILURE
[INFO] ------------------------------------------------------------------------
[INFO] Total time: 3:31.384s
[INFO] Finished at: Sun Aug 04 14:19:15 UTC 2013
[INFO] Final Memory: 30M/385M
[INFO] ------------------------------------------------------------------------
[ERROR] Failed to execute goal org.apache.maven.plugins:maven-surefire-plugin:2.15:test (default-test)
on project jspwiki-war: There are test failures.
[ERROR] 
[ERROR] Please refer to /home/hudson/jenkins-slave/workspace/JSPWiki/jspwiki-war/target/surefire-reports
for the individual test results.
[ERROR] -> [Help 1]
[ERROR] 
[ERROR] To see the full stack trace of the errors, re-run Maven with the -e switch.
[ERROR] Re-run Maven using the -X switch to enable full debug logging.
[ERROR] 
[ERROR] For more information about the errors and possible solutions, please read the following
articles:
[ERROR] [Help 1] http://cwiki.apache.org/confluence/display/MAVEN/MojoFailureException
[ERROR] 
[ERROR] After correcting the problems, you can resume the build with the command
[ERROR]   mvn <goals> -rf :jspwiki-war
Build step 'Invoke top-level Maven targets' marked build as failure

Mime
View raw message