jspwiki-commits mailing list archives

Site index · List index
Message view « Date » · « Thread »
Top « Date » · « Thread »
From Apache Jenkins Server <jenk...@builds.apache.org>
Subject Build failed in Jenkins: JSPWiki #126
Date Sun, 02 Jun 2013 12:06:02 GMT
See <https://builds.apache.org/job/JSPWiki/126/changes>

Changes:

[juanpablo] * 2.10.0-svn-3

* JSPWIKI-771: inherit ASF parent pom. Deleted release profile in favour of
  apache-release and gpg configuration (both present on parent pom);
  added <ciManagement/>, <issueManagement/> and <mailingLists/> sections.
       
* fixed runtime NPE on WikiJSPFilter (m_engine used before having been initialized)

[juanpablo] * JSPWIKI-771: inherit ASF parent pom. Deleted release profile in favour of
  apache-release and gpg configuration (both present on parent pom);
  added <ciManagement/>, <issueManagement/> and <mailingLists/> sections.

[juanpablo] fixed runtime NPE on WikiJSPFilter (m_engine used before having been initialized)

[metskem] 2013-06-01  Harry Metske (metskem@apache.org)

       * 2.10.0-svn-2

       * JSPWIKI-396: UTF-8 characters in wiki pages incorrectly rendered if served by Weblogic

[juanpablo] * 2.10.0-svn-1

* JSPWIKI-770: added jspwiki-it-test-container and jspwiki-it-test-container-jdbc
  selenium maven execution. Still some bits of refactor remaining + the IT 
  tests are assuming english language, but the base configuration is finished
       
* artifact checksums created on release profile

[juanpablo] removed duplicated file

[juanpablo] JSPWIKI-770: removed all Selenium related stuff from jspwiki-war

[juanpablo] removed unused dependency

[juanpablo] artifact checksums created on release profile

updated selenium-*-driver dependencies to 2.33.0 + Removed unneeded selenium dependencies

[juanpablo] JSPWIKI-770: added jspwiki-it-test-container and jspwiki-it-test-container-jdbc
modules. Still some bits of refactor remaining + the IT tests are assuming english language,
but the base configuration is finished

[juanpablo] JSPWIKI-770: added needed file for container-based IT testing

[juanpablo] added missing file needed for jdbc IT testing

[juanpablo] should stop commits on early morning..

[juanpablo] forgot to commit ChangeLog for 2.10.0..

[juanpablo] moving MVN3_BRANCH to trunk

[juanpablo] o.a.w.Release pointing to 2.10.0-svn-0

all pom.xml files pointing to 2.10.0-SNAPSHOT.

fixed checkstyle & codestyle files location at maven-eclipse-plugin

[juanpablo] moved configuration from jspwiki-war/pom.xml to ./pom.xml

some inline comments from jspwiki-war/pom.xml moved to mvn_cheat-sheet.txt

[juanpablo] removed duplicated files, updated ChangeLog with jspwiki-war/ChangeLog

[juanpablo] synchronizing with trunk..

[juanpablo] preparing to move trunk..

[juanpablo] some cleanup before merging trunk
- version goes to 2.9.2-SNAPSHOT
- added jspwiki-it-test-custom-jdbc selenium test executions, which wasn't as straightforward
as I thought it would be
- some cleanup on jspwiki-it*/pom.xml

[juanpablo] firefox used by default on selenium tests execution

added cobertura report generation to mvn_cheat-sheet.txt

[juanpablo] integration tests are launched only if -Pintegration-tests is given (JSPWIKI-770)

added clirr-maven-plugin configuration

[juanpablo] JSPWIKI-770:                                                            
- added custom auth, absolute URLs module for selenium execution
- moved common selenium execution configuration to custom profile, integration tests are launched
only if -Pintegration-tests is given

------------------------------------------
[...truncated 7504 lines...]
Properties in file /src/main/resources/plugin/PluginResources_fr.properties
---------------------------------------------------------------------------
Missing:
--------

Outdated or superfluous:
------------------------

Properties in file /src/main/resources/CoreResources_it.properties
------------------------------------------------------------------
Missing:
--------
security.error.cannot.rename = Cannot rename: the login name ''{0}'' is already taken.
security.error.fullname.taken = The full name ''{0}'' is already taken.
security.error.login.taken = The login name ''{0}'' is already taken.
security.user.fullname.invalid = Invalid Username

Outdated or superfluous:
------------------------

Properties in file /src/main/resources/templates/default_it.properties
----------------------------------------------------------------------
Missing:
--------
notification.createUserProfile.accept.content = Congratulations! Your new profile on {0} has
been created. Your profile details are as follows: 

Login name: {1} 
Your name : {2} 
E-mail    : {3} 

If you forget your password, you can reset it at {4}
notification.createUserProfile.accept.subject = Welcome to {0}

Outdated or superfluous:
------------------------

Properties in file /src/main/resources/plugin/PluginResources_it.properties
---------------------------------------------------------------------------
Missing:
--------

Outdated or superfluous:
------------------------
plugin.insert.definepage = Dovete definire una pagina!
plugin.insert.nopage1 = Non esiste una pagina chiamata
plugin.insert.nopage2 = Vorreste
plugin.insert.nopage3 = crearla?
plugin.insert.nopermission = Non avete i permessi per visualizzare questa pagina inclusa.
plugin.insert.notfound = La pagina non &egrave; stata trovata.
plugin.insert.recursion = Errore: Riferimento Circolare - non &grave; possibile includere
una pagina dentro s&grave; stessa!

Properties in file /src/main/resources/CoreResources_nl.properties
------------------------------------------------------------------
Missing:
--------

Outdated or superfluous:
------------------------

Properties in file /src/main/resources/templates/default_nl.properties
----------------------------------------------------------------------
Missing:
--------

Outdated or superfluous:
------------------------

Properties in file /src/main/resources/plugin/PluginResources_nl.properties
---------------------------------------------------------------------------
Missing:
--------

Outdated or superfluous:
------------------------

Properties in file /src/main/resources/CoreResources_pt_BR.properties
---------------------------------------------------------------------
Missing:
--------
security.error.cannot.rename = Cannot rename: the login name ''{0}'' is already taken.
security.error.fullname.taken = The full name ''{0}'' is already taken.
security.error.login.taken = The login name ''{0}'' is already taken.

Outdated or superfluous:
------------------------

Properties in file /src/main/resources/templates/default_pt_BR.properties
-------------------------------------------------------------------------
Missing:
--------
notification.createUserProfile.accept.content = Congratulations! Your new profile on {0} has
been created. Your profile details are as follows: 

Login name: {1} 
Your name : {2} 
E-mail    : {3} 

If you forget your password, you can reset it at {4}
notification.createUserProfile.accept.subject = Welcome to {0}

Outdated or superfluous:
------------------------

Properties in file /src/main/resources/plugin/PluginResources_pt_BR.properties
------------------------------------------------------------------------------
Missing:
--------

Outdated or superfluous:
------------------------

Properties in file /src/main/resources/CoreResources_ru.properties
------------------------------------------------------------------
Missing:
--------
security.error.cannot.rename = Cannot rename: the login name ''{0}'' is already taken.
security.error.fullname.taken = The full name ''{0}'' is already taken.
security.error.login.taken = The login name ''{0}'' is already taken.
security.user.fullname.invalid = Invalid Username

Outdated or superfluous:
------------------------

Properties in file /src/main/resources/templates/default_ru.properties
----------------------------------------------------------------------
Missing:
--------
notification.createUserProfile.accept.content = Congratulations! Your new profile on {0} has
been created. Your profile details are as follows: 

Login name: {1} 
Your name : {2} 
E-mail    : {3} 

If you forget your password, you can reset it at {4}
notification.createUserProfile.accept.subject = Welcome to {0}

Outdated or superfluous:
------------------------

Properties in file /src/main/resources/plugin/PluginResources_ru.properties
---------------------------------------------------------------------------
Missing:
--------

Outdated or superfluous:
------------------------

Properties in file /src/main/resources/CoreResources_zh_CN.properties
---------------------------------------------------------------------
Missing:
--------
security.error.cannot.rename = Cannot rename: the login name ''{0}'' is already taken.
security.error.fullname.taken = The full name ''{0}'' is already taken.
security.error.login.taken = The login name ''{0}'' is already taken.
security.user.fullname.invalid = Invalid Username

Outdated or superfluous:
------------------------

Properties in file /src/main/resources/templates/default_zh_CN.properties
-------------------------------------------------------------------------
Missing:
--------
notification.createUserProfile.accept.content = Congratulations! Your new profile on {0} has
been created. Your profile details are as follows: 

Login name: {1} 
Your name : {2} 
E-mail    : {3} 

If you forget your password, you can reset it at {4}
notification.createUserProfile.accept.subject = Welcome to {0}

Outdated or superfluous:
------------------------

Properties in file /src/main/resources/plugin/PluginResources_zh_CN.properties
------------------------------------------------------------------------------
Missing:
--------

Outdated or superfluous:
------------------------

Tests run: 1, Failures: 0, Errors: 0, Skipped: 0, Time elapsed: 0.076 sec
Running org.apache.wiki.attachment.AttachmentManagerTest
Tests run: 14, Failures: 0, Errors: 0, Skipped: 0, Time elapsed: 0.264 sec
Running org.apache.wiki.WikiEngineTest
Tests run: 43, Failures: 0, Errors: 0, Skipped: 0, Time elapsed: 19.223 sec
Running org.apache.wiki.i18n.InternationalizationManagerTest
Tests run: 2, Failures: 0, Errors: 0, Skipped: 0, Time elapsed: 0.016 sec
Running org.apache.wiki.parser.JSPWikiMarkupParserTest
100 page renderings: 0:00:00.186 (537.6344086021505 renderings/second)
Trying to crash parser with a line which is 198002 chars in size
Tests run: 205, Failures: 0, Errors: 0, Skipped: 0, Time elapsed: 2.851 sec
Running org.apache.wiki.parser.CreoleToJSPWikiTranslatorTest
Tests run: 84, Failures: 0, Errors: 0, Skipped: 0, Time elapsed: 0.14 sec
Running org.apache.wiki.parser.MarkupParserTest
Tests run: 3, Failures: 0, Errors: 0, Skipped: 0, Time elapsed: 0.001 sec
Running org.apache.wiki.stress.MassiveRepositoryTest
Creating 1000 pages
....................................................................................................
Took 0:00:06.836, which is 146.2843768285547 adds/second
Checking in 1000 revisions
....................................................................................................
Took 0:00:11.053, which is 90.47317470370035 adds/second
Rendering 10000 pages
....................................................................................................
Took 0:00:02.606, which is 3837.298541826554 renders/second
Tests run: 1, Failures: 0, Errors: 0, Skipped: 0, Time elapsed: 20.781 sec

Results :

Failed tests: 
  org.apache.wiki.plugin.UndefinedPagesPluginTest#testCount ComparisonFailure ex...

Tests run: 946, Failures: 1, Errors: 0, Skipped: 0

[INFO] ------------------------------------------------------------------------
[INFO] Reactor Summary:
[INFO] 
[INFO] Apache JSPWiki (Incubating) ....................... SUCCESS [4.052s]
[INFO] Apache JSPWiki (Incubating) ....................... FAILURE [1:38.409s]
[INFO] jspwiki-selenium-tests ............................ SKIPPED
[INFO] jspwiki-it-builder ................................ SKIPPED
[INFO] jspwiki-it-test-custom ............................ SKIPPED
[INFO] jspwiki-it-test-custom-absolute-urls .............. SKIPPED
[INFO] jspwiki-it-test-custom-jdbc ....................... SKIPPED
[INFO] jspwiki-it-test-container ......................... SKIPPED
[INFO] jspwiki-it-test-container-jdbc .................... SKIPPED
[INFO] ------------------------------------------------------------------------
[INFO] BUILD FAILURE
[INFO] ------------------------------------------------------------------------
[INFO] Total time: 1:43.101s
[INFO] Finished at: Sun Jun 02 12:06:02 UTC 2013
[INFO] Final Memory: 32M/187M
[INFO] ------------------------------------------------------------------------
[ERROR] Failed to execute goal org.apache.maven.plugins:maven-surefire-plugin:2.14.1:test
(default-test) on project jspwiki-war: There are test failures.
[ERROR] 
[ERROR] Please refer to <https://builds.apache.org/job/JSPWiki/ws/jspwiki-war/target/surefire-reports>
for the individual test results.
[ERROR] -> [Help 1]
[ERROR] 
[ERROR] To see the full stack trace of the errors, re-run Maven with the -e switch.
[ERROR] Re-run Maven using the -X switch to enable full debug logging.
[ERROR] 
[ERROR] For more information about the errors and possible solutions, please read the following
articles:
[ERROR] [Help 1] http://cwiki.apache.org/confluence/display/MAVEN/MojoFailureException
[ERROR] 
[ERROR] After correcting the problems, you can resume the build with the command
[ERROR]   mvn <goals> -rf :jspwiki-war
Build step 'Invoke top-level Maven targets' marked build as failure

Mime
View raw message