jspwiki-commits mailing list archives

Site index · List index
Message view « Date » · « Thread »
Top « Date » · « Thread »
From Apache Jenkins Server <jenk...@builds.apache.org>
Subject Build failed in Jenkins: JSPWiki #129
Date Mon, 03 Jun 2013 12:03:00 GMT
See <https://builds.apache.org/job/JSPWiki/129/changes>

Changes:

[gmazza] Minor English cleanup missed in previous commit.

[gmazza] Removed unused resource strings, made TranslationsCheck less chatty.

------------------------------------------
[...truncated 8453 lines...]
Running org.apache.wiki.workflow.OutcomeTest
Tests run: 6, Failures: 0, Errors: 0, Skipped: 0, Time elapsed: 0.01 sec
Running org.apache.wiki.workflow.DecisionQueueTest
Tests run: 7, Failures: 0, Errors: 0, Skipped: 0, Time elapsed: 0.081 sec
Running org.apache.wiki.workflow.SimpleDecisionTest
Tests run: 16, Failures: 0, Errors: 0, Skipped: 0, Time elapsed: 0.001 sec
Running org.apache.wiki.workflow.FactTest
Tests run: 1, Failures: 0, Errors: 0, Skipped: 0, Time elapsed: 0 sec
Running org.apache.wiki.workflow.WorkflowManagerTest
Tests run: 4, Failures: 0, Errors: 0, Skipped: 0, Time elapsed: 0.036 sec
Running org.apache.wiki.workflow.TaskTest
Tests run: 12, Failures: 0, Errors: 0, Skipped: 0, Time elapsed: 0.001 sec
Running org.apache.wiki.workflow.ApprovalWorkflowTest
Tests run: 5, Failures: 0, Errors: 0, Skipped: 0, Time elapsed: 0.06 sec
Running org.apache.wiki.workflow.WorkflowTest
Tests run: 24, Failures: 0, Errors: 0, Skipped: 0, Time elapsed: 0.003 sec
Running org.apache.wiki.ReferenceManagerTest
Tests run: 18, Failures: 0, Errors: 0, Skipped: 0, Time elapsed: 0.34 sec
Running org.apache.wiki.site.SiteGeneratorTest
Checking /src/main/resources/CoreResources_de.properties...

Missing:
--------
security.error.cannot.rename = Cannot rename: the login name ''{0}'' is already taken.
security.error.fullname.taken = Someone with the name of ''{0}'' has already registered.
security.error.login.taken = The login name ''{0}'' is already taken.

Checking /src/main/resources/templates/default_de.properties...

Missing:
--------
notification.createUserProfile.accept.content = Congratulations! Your new profile on {0} has
been created. Your profile details are as follows: 

Login name: {1} 
Your name : {2} 
E-mail    : {3} 

If you forget your password, you can reset it at {4}
notification.createUserProfile.accept.subject = Welcome to {0}

Checking /src/main/resources/plugin/PluginResources_de.properties...
Checking /src/main/resources/CoreResources_es.properties...
Checking /src/main/resources/templates/default_es.properties...
Checking /src/main/resources/plugin/PluginResources_es.properties...
Checking /src/main/resources/CoreResources_fi.properties...

Missing:
--------
security.error.cannot.rename = Cannot rename: the login name ''{0}'' is already taken.
security.error.fullname.taken = Someone with the name of ''{0}'' has already registered.
security.error.login.taken = The login name ''{0}'' is already taken.

Checking /src/main/resources/templates/default_fi.properties...

Missing:
--------
notification.createUserProfile.accept.content = Congratulations! Your new profile on {0} has
been created. Your profile details are as follows: 

Login name: {1} 
Your name : {2} 
E-mail    : {3} 

If you forget your password, you can reset it at {4}
notification.createUserProfile.accept.subject = Welcome to {0}

Checking /src/main/resources/plugin/PluginResources_fi.properties...
Checking /src/main/resources/CoreResources_fr.properties...

Missing:
--------
security.error.cannot.rename = Cannot rename: the login name ''{0}'' is already taken.
security.error.fullname.taken = Someone with the name of ''{0}'' has already registered.
security.error.login.taken = The login name ''{0}'' is already taken.

Checking /src/main/resources/templates/default_fr.properties...

Missing:
--------
notification.createUserProfile.accept.content = Congratulations! Your new profile on {0} has
been created. Your profile details are as follows: 

Login name: {1} 
Your name : {2} 
E-mail    : {3} 

If you forget your password, you can reset it at {4}
notification.createUserProfile.accept.subject = Welcome to {0}

Checking /src/main/resources/plugin/PluginResources_fr.properties...
Checking /src/main/resources/CoreResources_it.properties...

Missing:
--------
security.error.cannot.rename = Cannot rename: the login name ''{0}'' is already taken.
security.error.fullname.taken = Someone with the name of ''{0}'' has already registered.
security.error.login.taken = The login name ''{0}'' is already taken.
security.user.fullname.invalid = Invalid Username

Checking /src/main/resources/templates/default_it.properties...

Missing:
--------
notification.createUserProfile.accept.content = Congratulations! Your new profile on {0} has
been created. Your profile details are as follows: 

Login name: {1} 
Your name : {2} 
E-mail    : {3} 

If you forget your password, you can reset it at {4}
notification.createUserProfile.accept.subject = Welcome to {0}

Checking /src/main/resources/plugin/PluginResources_it.properties...
Checking /src/main/resources/CoreResources_nl.properties...
Checking /src/main/resources/templates/default_nl.properties...
Checking /src/main/resources/plugin/PluginResources_nl.properties...
Checking /src/main/resources/CoreResources_pt_BR.properties...

Missing:
--------
security.error.cannot.rename = Cannot rename: the login name ''{0}'' is already taken.
security.error.fullname.taken = Someone with the name of ''{0}'' has already registered.
security.error.login.taken = The login name ''{0}'' is already taken.

Checking /src/main/resources/templates/default_pt_BR.properties...

Missing:
--------
notification.createUserProfile.accept.content = Congratulations! Your new profile on {0} has
been created. Your profile details are as follows: 

Login name: {1} 
Your name : {2} 
E-mail    : {3} 

If you forget your password, you can reset it at {4}
notification.createUserProfile.accept.subject = Welcome to {0}

Checking /src/main/resources/plugin/PluginResources_pt_BR.properties...
Checking /src/main/resources/CoreResources_ru.properties...

Missing:
--------
security.error.cannot.rename = Cannot rename: the login name ''{0}'' is already taken.
security.error.fullname.taken = Someone with the name of ''{0}'' has already registered.
security.error.login.taken = The login name ''{0}'' is already taken.
security.user.fullname.invalid = Invalid Username

Checking /src/main/resources/templates/default_ru.properties...

Missing:
--------
notification.createUserProfile.accept.content = Congratulations! Your new profile on {0} has
been created. Your profile details are as follows: 

Login name: {1} 
Your name : {2} 
E-mail    : {3} 

If you forget your password, you can reset it at {4}
notification.createUserProfile.accept.subject = Welcome to {0}

Checking /src/main/resources/plugin/PluginResources_ru.properties...
Checking /src/main/resources/CoreResources_zh_CN.properties...

Missing:
--------
security.error.cannot.rename = Cannot rename: the login name ''{0}'' is already taken.
security.error.fullname.taken = Someone with the name of ''{0}'' has already registered.
security.error.login.taken = The login name ''{0}'' is already taken.
security.user.fullname.invalid = Invalid Username

Checking /src/main/resources/templates/default_zh_CN.properties...

Missing:
--------
notification.createUserProfile.accept.content = Congratulations! Your new profile on {0} has
been created. Your profile details are as follows: 

Login name: {1} 
Your name : {2} 
E-mail    : {3} 

If you forget your password, you can reset it at {4}
notification.createUserProfile.accept.subject = Welcome to {0}

Checking /src/main/resources/plugin/PluginResources_zh_CN.properties...
Tests run: 1, Failures: 0, Errors: 0, Skipped: 0, Time elapsed: 0.073 sec
Running org.apache.wiki.attachment.AttachmentManagerTest
Tests run: 14, Failures: 0, Errors: 0, Skipped: 0, Time elapsed: 0.23 sec
Running org.apache.wiki.WikiEngineTest
Tests run: 43, Failures: 0, Errors: 0, Skipped: 0, Time elapsed: 19.068 sec
Running org.apache.wiki.i18n.InternationalizationManagerTest
Tests run: 2, Failures: 0, Errors: 0, Skipped: 0, Time elapsed: 0.023 sec
Running org.apache.wiki.parser.JSPWikiMarkupParserTest
100 page renderings: 0:00:00.281 (355.87188612099646 renderings/second)
Trying to crash parser with a line which is 198002 chars in size
Tests run: 205, Failures: 0, Errors: 0, Skipped: 0, Time elapsed: 3.103 sec
Running org.apache.wiki.parser.CreoleToJSPWikiTranslatorTest
Tests run: 84, Failures: 0, Errors: 0, Skipped: 0, Time elapsed: 0.15 sec
Running org.apache.wiki.parser.MarkupParserTest
Tests run: 3, Failures: 0, Errors: 0, Skipped: 0, Time elapsed: 0 sec
Running org.apache.wiki.stress.MassiveRepositoryTest
Creating 1000 pages
....................................................................................................
Took 0:00:06.912, which is 144.67592592592592 adds/second
Checking in 1000 revisions
....................................................................................................
Took 0:00:10.961, which is 91.23255177447314 adds/second
Rendering 10000 pages
....................................................................................................
Took 0:00:02.653, which is 3769.317753486619 renders/second
Tests run: 1, Failures: 0, Errors: 0, Skipped: 0, Time elapsed: 20.798 sec

Results :

Failed tests: 
  org.apache.wiki.plugin.UndefinedPagesPluginTest#testCount ComparisonFailure ex...

Tests run: 946, Failures: 1, Errors: 0, Skipped: 0

[INFO] ------------------------------------------------------------------------
[INFO] Reactor Summary:
[INFO] 
[INFO] Apache JSPWiki (Incubating) ....................... SUCCESS [2.487s]
[INFO] Apache JSPWiki (Incubating) ....................... FAILURE [1:34.962s]
[INFO] jspwiki-selenium-tests ............................ SKIPPED
[INFO] jspwiki-it-builder ................................ SKIPPED
[INFO] jspwiki-it-test-custom ............................ SKIPPED
[INFO] jspwiki-it-test-custom-absolute-urls .............. SKIPPED
[INFO] jspwiki-it-test-custom-jdbc ....................... SKIPPED
[INFO] jspwiki-it-test-container ......................... SKIPPED
[INFO] jspwiki-it-test-container-jdbc .................... SKIPPED
[INFO] ------------------------------------------------------------------------
[INFO] BUILD FAILURE
[INFO] ------------------------------------------------------------------------
[INFO] Total time: 1:38.088s
[INFO] Finished at: Mon Jun 03 12:02:59 UTC 2013
[INFO] Final Memory: 35M/286M
[INFO] ------------------------------------------------------------------------
[ERROR] Failed to execute goal org.apache.maven.plugins:maven-surefire-plugin:2.14.1:test
(default-test) on project jspwiki-war: There are test failures.
[ERROR] 
[ERROR] Please refer to <https://builds.apache.org/job/JSPWiki/ws/jspwiki-war/target/surefire-reports>
for the individual test results.
[ERROR] -> [Help 1]
[ERROR] 
[ERROR] To see the full stack trace of the errors, re-run Maven with the -e switch.
[ERROR] Re-run Maven using the -X switch to enable full debug logging.
[ERROR] 
[ERROR] For more information about the errors and possible solutions, please read the following
articles:
[ERROR] [Help 1] http://cwiki.apache.org/confluence/display/MAVEN/MojoFailureException
[ERROR] 
[ERROR] After correcting the problems, you can resume the build with the command
[ERROR]   mvn <goals> -rf :jspwiki-war
Build step 'Invoke top-level Maven targets' marked build as failure

Mime
View raw message