jmeter-user mailing list archives

Site index · List index
Message view « Date » · « Thread »
Top « Date » · « Thread »
From Felix Schumacher <felix.schumac...@internetallee.de>
Subject Re: 131 tests are getting failed while running "ant test" command
Date Thu, 07 Feb 2019 19:55:01 GMT

Am 07.02.19 um 09:59 schrieb Sanjay Chaurasia:
> Dear Felix,
>
> Thank you for your response. I have set the character encoding in the environment variable
as you suggested.
>   JAVA_TOOL_OPTIONS to -Dfile.encoding=UTF8.
>   
> 8 tests, which were getting failed, have been passed.
>
> Still there are 122 tests are getting failed. And all tests have same root cause. Please
have a look below log
>
> [java] 122) testLang(org.apache.jmeter.resources.PackageTest)

That still seems to be the same problem, that your environment has the 
wrong encoding for the files.

As I am no expert for windows based systems, so I would not be able to 
give you any more advise here. Maybe someone else can help you.

Sorry,

  Felix

>       [java] junit.framework.AssertionFailedError: One or more subtests failed
>       [java] 	at junit.framework.Assert.fail(Assert.java:57)
>       [java] 	at junit.framework.TestCase.fail(TestCase.java:227)
>       [java] 	at org.apache.jmeter.resources.PackageTest.check(PackageTest.java:228)
>       [java] 	at org.apache.jmeter.resources.PackageTest.check(PackageTest.java:172)
>       [java] 	at org.apache.jmeter.resources.PackageTest.testLang(PackageTest.java:329)
>       [java] 	at sun.reflect.GeneratedMethodAccessor86.invoke(Unknown Source)
>       [java] 	at sun.reflect.DelegatingMethodAccessorImpl.invoke(Unknown Source)
>       [java] 	at java.lang.reflect.Method.invoke(Unknown Source)
>       [java] 	at junit.framework.TestCase.runTest(TestCase.java:176)
>       [java] 	at junit.framework.TestCase.runBare(TestCase.java:141)
>       [java] 	at junit.framework.TestResult$1.protect(TestResult.java:122)
>       [java] 	at junit.framework.TestResult.runProtected(TestResult.java:142)
>       [java] 	at junit.framework.TestResult.run(TestResult.java:125)
>       [java] 	at junit.framework.TestCase.run(TestCase.java:129)
>       [java] 	at junit.framework.TestSuite.runTest(TestSuite.java:252)
>       [java] 	at junit.framework.TestSuite.run(TestSuite.java:247)
>       [java] 	at junit.framework.TestSuite.runTest(TestSuite.java:252)
>       [java] 	at junit.framework.TestSuite.run(TestSuite.java:247)
>       [java] 	at org.junit.internal.runners.JUnit38ClassRunner.run(JUnit38ClassRunner.java:86)
>       [java] 	at org.junit.runners.Suite.runChild(Suite.java:128)
>       [java] 	at org.junit.runners.Suite.runChild(Suite.java:27)
>       [java] 	at org.junit.runners.ParentRunner$3.run(ParentRunner.java:290)
>       [java] 	at org.junit.runners.ParentRunner$1.schedule(ParentRunner.java:71)
>       [java] 	at org.junit.runners.ParentRunner.runChildren(ParentRunner.java:288)
>       [java] 	at org.junit.runners.ParentRunner.access$000(ParentRunner.java:58)
>       [java] 	at org.junit.runners.ParentRunner$2.evaluate(ParentRunner.java:268)
>       [java] 	at org.junit.runners.ParentRunner.run(ParentRunner.java:363)
>       [java] 	at org.junit.runner.JUnitCore.run(JUnitCore.java:137)
>       [java] 	at org.junit.runner.JUnitCore.run(JUnitCore.java:115)
>       [java] 	at org.apache.jorphan.test.AllTests.main(AllTests.java:219)
>       [java] FAILURES!!!
>       [java] Tests run: 3312,  Failures: 122
>       [java] ................................................................................
>       [java] Time: 4.329
>       [java] OK (80 tests)
>       [java] Picked up JAVA_TOOL_OPTIONS: -Dfile.encoding=UTF-8
>
> BUILD FAILED
> C:\Users\sanjay.chaurasia\Desktop\jmeter\trunk\build.xml:3181: Java returned: 1
>
> If you have any idea of the root cause, please share.
> I will be highly grateful to you.
>
>
> Regards,
> Sanjay Chaurasia
>
> -----Original Message-----
> From: Felix Schumacher [mailto:felix.schumacher@internetallee.de]
> Sent: Tuesday, February 5, 2019 12:16 PM
> To: JMeter Users List <user@jmeter.apache.org>
> Subject: RE: 131 tests are getting failed while running "ant test" command
>
>
>
> Am 5. Februar 2019 07:02:14 MEZ schrieb Sanjay Chaurasia <Sanjay.Chaurasia@india.nec.com>:
>> Please find below "ant test" logs
>>
>> [java] junit.framework.AssertionFailedError: One or more subtests
>> failed
>>      [java] 	at junit.framework.Assert.fail(Assert.java:57)
>>      [java] 	at junit.framework.TestCase.fail(TestCase.java:227)
>> [java] 	at
>> org.apache.jmeter.resources.PackageTest.check(PackageTest.java:228)
>> [java] 	at
>> org.apache.jmeter.resources.PackageTest.check(PackageTest.java:172)
>> [java] 	at
>> org.apache.jmeter.resources.PackageTest.testLang(PackageTest.java:329)
>> [java] 	at sun.reflect.GeneratedMethodAccessor86.invoke(Unknown Source)
>> [java] 	at sun.reflect.DelegatingMethodAccessorImpl.invoke(Unknown
>> Source)
>>      [java] 	at java.lang.reflect.Method.invoke(Unknown Source)
>>      [java] 	at junit.framework.TestCase.runTest(TestCase.java:176)
>>      [java] 	at junit.framework.TestCase.runBare(TestCase.java:141)
>>    [java] 	at junit.framework.TestResult$1.protect(TestResult.java:122)
>> [java] 	at junit.framework.TestResult.runProtected(TestResult.java:142)
>>      [java] 	at junit.framework.TestResult.run(TestResult.java:125)
>>      [java] 	at junit.framework.TestCase.run(TestCase.java:129)
>>      [java] 	at junit.framework.TestSuite.runTest(TestSuite.java:252)
>>      [java] 	at junit.framework.TestSuite.run(TestSuite.java:247)
>>      [java] 	at junit.framework.TestSuite.runTest(TestSuite.java:252)
>>      [java] 	at junit.framework.TestSuite.run(TestSuite.java:247)
>> [java] 	at
>> org.junit.internal.runners.JUnit38ClassRunner.run(JUnit38ClassRunner.java:86)
>>      [java] 	at org.junit.runners.Suite.runChild(Suite.java:128)
>>      [java] 	at org.junit.runners.Suite.runChild(Suite.java:27)
>> [java] 	at org.junit.runners.ParentRunner$3.run(ParentRunner.java:290)
>> [java] 	at
>> org.junit.runners.ParentRunner$1.schedule(ParentRunner.java:71)
>> [java] 	at
>> org.junit.runners.ParentRunner.runChildren(ParentRunner.java:288)
>> [java] 	at
>> org.junit.runners.ParentRunner.access$000(ParentRunner.java:58)
>> [java] 	at
>> org.junit.runners.ParentRunner$2.evaluate(ParentRunner.java:268)
>>    [java] 	at org.junit.runners.ParentRunner.run(ParentRunner.java:363)
>>      [java] 	at org.junit.runner.JUnitCore.run(JUnitCore.java:137)
>>      [java] 	at org.junit.runner.JUnitCore.run(JUnitCore.java:115)
>>     [java] 	at org.apache.jorphan.test.AllTests.main(AllTests.java:219)
>>      [java] FAILURES!!!
>>      [java] Tests run: 3312,  Failures: 130 [java]
>> .....................................................E...........................
>>      [java] Time: 4.468
>>      [java] There was 1 failure:
>> [java] 1)
>> testUnEscapeHtml2(org.apache.jmeter.functions.TestSimpleFunctions)
>> [java] org.junit.ComparisonFailure: expected:<<Fran[ç]ais>> but
>> was:<<Fran[ç]ais>>
> What is your default character encoding set to? On Linux this would be the content of
the environment variable LANG.
>
> Regards,
>   Felix
>
>> ---------------------------------------------------------------------
>> To unsubscribe, e-mail: user-unsubscribe@jmeter.apache.org
>> For additional commands, e-mail: user-help@jmeter.apache.org
> ---------------------------------------------------------------------
> To unsubscribe, e-mail: user-unsubscribe@jmeter.apache.org
> For additional commands, e-mail: user-help@jmeter.apache.org
>
>
>
> ---------------------------------------------------------------------
> To unsubscribe, e-mail: user-unsubscribe@jmeter.apache.org
> For additional commands, e-mail: user-help@jmeter.apache.org

---------------------------------------------------------------------
To unsubscribe, e-mail: user-unsubscribe@jmeter.apache.org
For additional commands, e-mail: user-help@jmeter.apache.org


Mime
View raw message