jmeter-dev mailing list archives

Site index · List index
Message view « Date » · « Thread »
Top « Date » · « Thread »
From Apache Jenkins Server <jenk...@builds.apache.org>
Subject Build failed in Jenkins: JMeter » JMeter-trunk #203
Date Fri, 15 Jan 2021 19:11:26 GMT
See <https://ci-builds.apache.org/job/JMeter/job/JMeter-trunk/203/display/redirect?page=changes>

Changes:

[Felix Schumacher] Partly revert "Silence warning of tika about missing sqlite-jdbc dependency"

[Felix Schumacher] Remove left-over constant that is not used anymore.

[Felix Schumacher] Remove leftover log message from debug session

[Felix Schumacher] Move tika-config.xml into the JAR file for the http component

[Felix Schumacher] Use correct path for tika-config.xml


------------------------------------------
[...truncated 31.34 KB...]
> Task :src:protocol:mail:processTestResources NO-SOURCE
> Task :src:protocol:mongodb:processTestResources NO-SOURCE
> Task :src:protocol:tcp:processTestResources NO-SOURCE
> Task :src:protocol:native:processTestResources NO-SOURCE
> Task :src:generator:processResources NO-SOURCE
> Task :src:protocol:junit-sample:processResources NO-SOURCE
> Task :src:testkit:testFixturesJar
> Task :src:generator:autostyleConfigsCheck NO-SOURCE
> Task :src:examples:autostyleConfigsCheck
> Task :src:protocol:jdbc:processResources
> Task :src:protocol:jdbc:processTestResources NO-SOURCE
> Task :src:launcher:autostyleConfigsCheck NO-SOURCE
> Task :src:protocol:http:processTestResources
> Task :src:functions:autostyleConfigsCheck
> Task :src:licenses:autostyleConfigsCheck NO-SOURCE
> Task :src:licenses:autostyleJavaCheck NO-SOURCE
> Task :src:functions:autostyleGroovyCheck
> Task :src:dist-check:autostyleGroovyCheck
> Task :src:components:autostyleConfigsCheck
> Task :src:components:autostyleGroovyCheck
> Task :src:core:processResources
> Task :src:core:processTestResources
> Task :autostyleConfigsCheck
> Task :autostyleJavaCheck NO-SOURCE
> Task :src:core:autostyleConfigsCheck
> Task :src:core:autostyleGroovyCheck
Retrying Downloading key 21939ff0ca2a6567 for commons-codec:commons-codec:1.15@jar.asc (attempt
1 of 40, 62.210.124.230, hkp://pool.sks-keyservers.net): Keyserver should respond with successful
HTTP codes (200..300), actual code is 429, url: http://pool.sks-keyservers.net:11371/pks/lookup?op=get&options=mr&search=0x21939ff0ca2a6567
> Task :src:jorphan:compileJava FROM-CACHE
> Task :src:jorphan:compileGroovy NO-SOURCE
> Task :src:jorphan:processResources
> Task :src:jorphan:classes
> Task :src:jorphan:jar
> Task :src:bshclient:autostyleJavaCheck
> Task :src:generator:autostyleJavaCheck
> Task :src:examples:autostyleJavaCheck
> Task :src:launcher:autostyleJavaCheck
> Task :src:dist-check:autostyleJavaCheck
> Task :src:testkit-wiremock:compileJava FROM-CACHE
> Task :src:testkit-wiremock:processResources NO-SOURCE
> Task :src:testkit-wiremock:classes UP-TO-DATE
> Task :src:functions:autostyleJavaCheck
> Task :src:testkit-wiremock:jar
> Task :src:testkit-wiremock:compileTestFixturesJava NO-SOURCE
> Task :src:testkit-wiremock:processTestFixturesResources NO-SOURCE
> Task :src:testkit-wiremock:testFixturesClasses UP-TO-DATE
> Task :src:testkit-wiremock:testFixturesJar
> Task :src:protocol:autostyleConfigsCheck NO-SOURCE
> Task :src:protocol:autostyleJavaCheck NO-SOURCE
> Task :src:jorphan:compileTestJava FROM-CACHE
> Task :src:jorphan:compileTestGroovy FROM-CACHE
> Task :src:jorphan:processTestResources NO-SOURCE
> Task :src:jorphan:testClasses UP-TO-DATE
> Task :src:jorphan:testJar
> Task :src:jorphan:autostyleConfigsCheck NO-SOURCE
> Task :src:jorphan:autostyleGroovyCheck
> Task :src:examples:autostyleKotlinGradleCheck
> Task :src:examples:autostyleMarkdownCheck NO-SOURCE
> Task :src:examples:autostyleCheck
> Task :src:bshclient:autostyleKotlinGradleCheck
> Task :src:generator:autostyleKotlinGradleCheck
> Task :src:generator:autostyleMarkdownCheck NO-SOURCE
> Task :src:generator:autostyleCheck
> Task :src:bshclient:autostyleMarkdownCheck NO-SOURCE
> Task :src:bshclient:autostyleCheck
> Task :src:functions:autostyleKotlinGradleCheck
> Task :src:functions:autostyleMarkdownCheck NO-SOURCE
> Task :src:functions:autostyleCheck
> Task :src:launcher:autostyleKotlinGradleCheck
> Task :src:launcher:autostyleMarkdownCheck NO-SOURCE
> Task :src:launcher:autostyleCheck
> Task :src:config:autostyleKotlinGradleCheck
> Task :src:protocol:autostyleKotlinGradleCheck
> Task :src:config:autostyleMarkdownCheck NO-SOURCE
> Task :src:protocol:autostyleMarkdownCheck NO-SOURCE
> Task :src:bom:autostyleKotlinGradleCheck
> Task :src:bom:autostyleMarkdownCheck NO-SOURCE
> Task :src:bom:autostyleCheck
> Task :src:bom:check
> Task :src:config:autostyleCheck
> Task :src:autostyleKotlinGradleCheck
> Task :src:protocol:autostyleCheck
> Task :src:protocol:checkstyleMain NO-SOURCE
> Task :src:config:checkstyleMain NO-SOURCE
> Task :src:autostyleMarkdownCheck NO-SOURCE
> Task :src:licenses:autostyleKotlinGradleCheck
> Task :src:protocol:checkstyleTest NO-SOURCE
> Task :src:dist-check:autostyleKotlinGradleCheck
> Task :src:autostyleCheck
> Task :src:config:checkstyleTest NO-SOURCE
> Task :src:check
> Task :src:config:compileJava NO-SOURCE
> Task :src:release:autostyleConfigsCheck NO-SOURCE
> Task :src:licenses:autostyleMarkdownCheck NO-SOURCE
> Task :src:protocol:compileJava NO-SOURCE
> Task :src:licenses:autostyleCheck
> Task :src:dist-check:autostyleMarkdownCheck NO-SOURCE
> Task :src:config:processResources NO-SOURCE
> Task :src:config:classes UP-TO-DATE
> Task :src:config:spotbugsMain NO-SOURCE
> Task :src:dist-check:autostyleCheck
> Task :src:config:compileTestJava NO-SOURCE
> Task :src:licenses:checkstyleMain NO-SOURCE
> Task :src:config:processTestResources NO-SOURCE
> Task :src:licenses:checkstyleTest NO-SOURCE
> Task :src:config:testClasses UP-TO-DATE
> Task :src:dist-check:checkstyleMain NO-SOURCE
> Task :src:config:spotbugsTest NO-SOURCE
> Task :src:config:test NO-SOURCE
> Task :src:licenses:compileJava NO-SOURCE
> Task :src:config:check
> Task :src:licenses:processResources NO-SOURCE
> Task :src:licenses:classes UP-TO-DATE
> Task :src:licenses:spotbugsMain NO-SOURCE
> Task :src:protocol:processResources NO-SOURCE
> Task :src:protocol:classes UP-TO-DATE
> Task :src:licenses:compileTestJava NO-SOURCE
> Task :src:protocol:spotbugsMain NO-SOURCE
> Task :src:licenses:processTestResources NO-SOURCE
> Task :src:protocol:compileTestJava NO-SOURCE
> Task :src:release:autostyleJavaCheck NO-SOURCE
> Task :src:licenses:testClasses UP-TO-DATE
> Task :src:licenses:spotbugsTest NO-SOURCE
> Task :src:licenses:test NO-SOURCE
> Task :src:licenses:check
> Task :src:testkit:autostyleConfigsCheck NO-SOURCE
> Task :src:protocol:processTestResources NO-SOURCE
> Task :src:protocol:testClasses UP-TO-DATE
> Task :src:testkit-wiremock:autostyleConfigsCheck NO-SOURCE
> Task :src:protocol:spotbugsTest NO-SOURCE
> Task :src:protocol:bolt:autostyleConfigsCheck
> Task :src:protocol:test NO-SOURCE
> Task :src:testkit:autostyleJavaCheck
> Task :src:protocol:check
> Task :src:protocol:ftp:autostyleConfigsCheck NO-SOURCE
> Task :src:release:autostyleKotlinGradleCheck
> Task :src:release:autostyleMarkdownCheck NO-SOURCE
> Task :src:testkit:autostyleKotlinGradleCheck
> Task :src:release:autostyleCheck
> Task :src:testkit:autostyleMarkdownCheck NO-SOURCE
> Task :src:release:checkstyleMain NO-SOURCE
> Task :src:testkit:autostyleCheck
> Task :src:testkit-wiremock:autostyleJavaCheck
> Task :src:release:checkstyleTest NO-SOURCE
> Task :src:protocol:bolt:autostyleGroovyCheck
> Task :src:release:compileJava NO-SOURCE
> Task :src:release:processResources NO-SOURCE
> Task :src:release:classes UP-TO-DATE
> Task :src:release:spotbugsMain NO-SOURCE
> Task :src:release:compileTestJava NO-SOURCE
> Task :src:release:processTestResources NO-SOURCE
> Task :src:release:testClasses UP-TO-DATE
> Task :src:release:spotbugsTest NO-SOURCE
> Task :src:release:test NO-SOURCE
> Task :src:release:check
> Task :src:protocol:ftp:autostyleJavaCheck
> Task :src:testkit-wiremock:autostyleKotlinGradleCheck
> Task :src:testkit-wiremock:autostyleMarkdownCheck NO-SOURCE
> Task :src:testkit-wiremock:autostyleCheck
> Task :src:protocol:ftp:autostyleKotlinGradleCheck NO-SOURCE
> Task :src:jorphan:autostyleJavaCheck
> Task :src:protocol:ftp:autostyleMarkdownCheck NO-SOURCE
> Task :src:protocol:ftp:autostyleCheck
> Task :src:protocol:bolt:autostyleJavaCheck
> Task :src:protocol:bolt:autostyleKotlinGradleCheck NO-SOURCE
> Task :src:protocol:bolt:autostyleMarkdownCheck NO-SOURCE
> Task :src:protocol:bolt:autostyleCheck
> Task :src:dist:autostyleKotlinGradleCheck
> Task :src:dist:autostyleMarkdownCheck NO-SOURCE
> Task :src:dist:autostyleCheck
> Task :src:dist:checkstyleMain NO-SOURCE
> Task :src:dist:checkstyleTest NO-SOURCE
> Task :src:dist:processResources NO-SOURCE
> Task :src:dist:processTestResources NO-SOURCE
> Task :src:jorphan:autostyleKotlinGradleCheck
> Task :src:jorphan:autostyleMarkdownCheck NO-SOURCE
> Task :src:jorphan:autostyleCheck
> Task :src:components:autostyleJavaCheck
> Task :src:protocol:java:autostyleConfigsCheck
> Task :autostyleKotlinGradleCheck
> Task :src:protocol:java:autostyleJavaCheck
> Task :src:components:autostyleKotlinGradleCheck
> Task :autostyleMarkdownCheck
> Task :autostyleCheck
> Task :src:protocol:java:autostyleKotlinGradleCheck NO-SOURCE
> Task :checkstyleMain NO-SOURCE
> Task :checkstyleTest NO-SOURCE
> Task :src:protocol:java:autostyleMarkdownCheck NO-SOURCE
> Task :src:protocol:java:autostyleCheck
> Task :src:components:autostyleMarkdownCheck NO-SOURCE
> Task :src:components:autostyleCheck
> Task :src:protocol:http:autostyleConfigsCheck FAILED
> Task :gitProps
> Task :src:core:autostyleJavaCheck
> Task :src:protocol:ftp:checkstyleMain
> Task :src:testkit:checkstyleMain
> Task :src:launcher:checkstyleMain
> Task :src:testkit-wiremock:checkstyleMain
> Task :src:bshclient:checkstyleMain
> Task :src:protocol:java:checkstyleMain
> Task :src:examples:checkstyleMain
> Task :src:generator:checkstyleMain
> Task :src:dist-check:checkstyleTest
> Task :src:protocol:bolt:checkstyleMain
> Task :src:functions:checkstyleMain
> Task :src:jorphan:checkstyleMain
> Task :src:components:checkstyleMain
checksum-dependency elapsed time: 47856ms, configurations processed: 104
    SHA-512 computation time: 1336ms (goes in parallel, it might exceed wall-clock time),
files processed: 25, processed: 9MiB, skipped: 1159MiB
    PGP signature resolution time: 3614ms (wall-clock), resolution requests: 62, signatures
resolved: 144
    PGP key resolution time: 35579ms (wall-clock), resolution requests: 62, download time:
24059ms (goes in parallel, it might exceed wall-clock time), keys downloaded: 57
        PGP signature verification time: 33314ms (goes in parallel, it might exceed wall-clock
time), files processed: 445, processed: 534MiB, skipped: 625MiB

FAILURE: Build failed with an exception.

* What went wrong:
Execution failed for task ':src:protocol:http:autostyleConfigsCheck'.
> The following files have format violations:
    src/protocol/http/src/main/resources/org/apache/jmeter/protocol/http/gui/action/tika-config.xml
      @@ -15,7 +15,7 @@
         ~ See the License for the specific language governing permissions and
         ~ limitations under the License.
         -->
      +
       <properties>
          <service-loader initializableProblemHandler="ignore"/>
       </properties>
      -
  Run './gradlew autostyleApply' to fix the violations.

* Try:
Run with --stacktrace option to get the stack trace. Run with --info or --debug option to
get more log output. Run with --scan to get full insights.

* Get more help at https://help.gradle.org

Deprecated Gradle features were used in this build, making it incompatible with Gradle 7.0.
Use '--warning-mode all' to show the individual deprecation warnings.
See https://docs.gradle.org/6.7/userguide/command_line_interface.html#sec:command_line_warnings

BUILD FAILED in 52s
119 actionable tasks: 83 executed, 6 from cache, 30 up-to-date

See the profiling report at: file://<https://ci-builds.apache.org/job/JMeter/job/JMeter-trunk/ws/build/reports/profile/profile-2021-01-15-19-10-36.html>
A fine-grained performance profile is available: use the --scan option.
Build step 'Invoke Gradle script' changed build result to FAILURE
Build step 'Invoke Gradle script' marked build as failure
Xvfb stopping
Archiving artifacts
Recording test results
ERROR: Step ?Publish JUnit test result report? failed: No test report files were found. Configuration
error?

Mime
View raw message